{"text_format":"1","workbook":"xlsx","n_sheets":3,"sheets":["Início","Calendário","Base"],"not_rendered":{"charts":0,"images":17,"macros":1,"external_links":0,"defined_names":4,"comments":1,"pivot_tables":0},"unopened":[],"bounds":{"document_bytes":16777216,"sheet_cells":100000,"rows_first":2000,"rows_last":500,"rows_between":2000,"halvings":0,"cell_chars":16384,"cell_head_chars":4096},"cells_cut":0,"cells_raw":0,"read":"whole","date_system":"1900"}

{"sheet":"Início","index":0,"n_rows":25,"n_cols":9,"rows_kept":25,"cut":false,"hidden":false,"merged":[]}
[]
[]
[]
[]
[]
[null,null,null,"Medicamento:"]
[]
[null,null,null,"Data de início:"]
[]
[null,null,null,"Hora do lembrete:",null,{"$f":"IF(F12=2,E10+G10,E10)","v":"00:00:00"},"12:00:00"]
[]
[null,null,null,"Frequência:",null,{"$f":"_xlfn.XLOOKUP(E12,Base!$I$5:$I$7,Base!$H$5:$H$7,\"\",0,1)","v":3}]
[]
[null,null,null,"Por quantos dias:"]
[null,null,null,null,{"$f":"COUNTA(E6,E8,E10,E12,E14)","v":0}]
[]
[]
[null,null,null,null,null,null,null,null,{"$f":"COUNTIF(I20:I25,\"Excluir\")","v":0}]
[null,null,"Lembrete","Medicamento","Data Início","Hora","Qtde dias","Status"]
[null,null,1,null,null,null,null,{"$f":"IF(I20=\"\",\"\",IF(I20=\"Salvo\",3,2))","v":""}]
[null,null,2,null,null,null,null,{"$f":"IF(I21=\"\",\"\",IF(I21=\"Salvo\",3,2))","v":""}]
[null,null,3,null,null,null,null,""]
[null,null,4,null,null,null,null,""]
[null,null,5,null,null,null,null,""]
[null,null,6,null,null,null,null,""]

{"sheet":"Calendário","index":1,"n_rows":767,"n_cols":42,"rows_kept":767,"cut":false,"hidden":false,"merged":[]}
[]
[]
[]
[]
[null,null,null,{"$f":"_xlfn.XLOOKUP($AA$10,Base!$T$5:$T$16,Base!$U$5:$U$16,\"\",0,1)&\"|\"&$AA$11","v":"DEZEMBRO|2023"},null,null,null,null,null,null,null,null,null,null,null,null,null,null,null,null,null,null,null,null,null,null,{"$f":"SMALL(Início!E20:'Início'!E25,1)","v":{"$error":"#NUM!"}}]
[null,null,null,1,null,null,2,null,null,3,null,null,4,null,null,5,null,null,6,null,null,7]
[null,null,null,"Domingo",null,null,"Segunda-feira",null,null,"Terça-feira",null,null,"Quarta-feira",null,null,"Quinta-feira",null,null,"Sexta-feira",null,null,"Sábado",null,null,null,"Data",{"$f":"IF(Início!$E$20=\"\",TODAY(),SMALL(Início!E20:'Início'!E25,1))","v":"2023-12-05"},null,"Data",{"$f":"IF(Início!$E$21=\"\",\"\",SMALL(Início!E20:'Início'!E25,2))","v":""},null,"Data",{"$f":"IF(Início!$E$22=\"\",\"\",SMALL(Início!E20:'Início'!E25,3))","v":""},null,"Data",{"$f":"IF(Início!$E$23=\"\",\"\",SMALL(Início!E20:'Início'!E25,4))","v":""},null,"Data",{"$f":"IF(Início!$E$24=\"\",\"\",SMALL(Início!E20:'Início'!E25,5))","v":""},null,"Data",{"$f":"IF(Início!$E$25=\"\",\"\",SMALL(Início!E20:'Início'!E25,6))","v":""}]
[null,null,null,{"$f":"IF(D6=$AA$13,1,IF(C9=\"\",\"\",C9+1))","v":""},{"$f":"IFERROR(IF(D8=$AA$9,\"Início do tratamento!\",IF(D8=$AD$9,\"Início do tratamento!\",IF(D8=$AG$9,\"Início do tratamento!\",IF(D8=$AJ$9,\"Início do tratamento!\",IF(D8=$AM$9,\"Início do tratamento!\",\"\"))))),\"\")","v":""},null,{"$f":"IF(G6=$AA$13,1,IF(D8=\"\",\"\",D8+1))","v":""},{"$f":"IFERROR(IF(G8=$AA$9,\"Início do tratamento!\",IF(G8=$AD$9,\"Início do tratamento!\",IF(G8=$AG$9,\"Início do tratamento!\",IF(G8=$AJ$9,\"Início do tratamento!\",IF(G8=$AM$9,\"Início do tratamento!\",\"\"))))),\"\")","v":""},null,{"$f":"IF(J6=$AA$13,1,IF(G8=\"\",\"\",G8+1))","v":""},{"$f":"IFERROR(IF(J8=$AA$9,\"Início do tratamento!\",IF(J8=$AD$9,\"Início do tratamento!\",IF(J8=$AG$9,\"Início do tratamento!\",IF(J8=$AJ$9,\"Início do tratamento!\",IF(J8=$AM$9,\"Início do tratamento!\",\"\"))))),\"\")","v":""},null,{"$f":"IF(M6=$AA$13,1,IF(J8=\"\",\"\",J8+1))","v":""},{"$f":"IFERROR(IF(M8=$AA$9,\"Início do tratamento!\",IF(M8=$AD$9,\"Início do tratamento!\",IF(M8=$AG$9,\"Início do tratamento!\",IF(M8=$AJ$9,\"Início do tratamento!\",IF(M8=$AM$9,\"Início do tratamento!\",\"\"))))),\"\")","v":""},null,{"$f":"IF(P6=$AA$13,1,IF(M8=\"\",\"\",M8+1))","v":""},{"$f":"IFERROR(IF(P8=$AA$9,\"Início do tratamento!\",IF(P8=$AD$9,\"Início do tratamento!\",IF(P8=$AG$9,\"Início do tratamento!\",IF(P8=$AJ$9,\"Início do tratamento!\",IF(P8=$AM$9,\"Início do tratamento!\",\"\"))))),\"\")","v":""},null,{"$f":"IF(S6=$AA$13,1,IF(P8=\"\",\"\",P8+1))","v":1},{"$f":"IFERROR(IF(S8=$AA$9,\"Início do tratamento!\",IF(S8=$AD$9,\"Início do tratamento!\",IF(S8=$AG$9,\"Início do tratamento!\",IF(S8=$AJ$9,\"Início do tratamento!\",IF(S8=$AM$9,\"Início do tratamento!\",\"\"))))),\"\")","v":""},null,{"$f":"IF(V6=$AA$13,1,IF(S8=\"\",\"\",S8+1))","v":2},{"$f":"IFERROR(IF(V8=$AA$9,\"Início do tratamento!\",IF(V8=$AD$9,\"Início do tratamento!\",IF(V8=$AG$9,\"Início do tratamento!\",IF(V8=$AJ$9,\"Início do tratamento!\",IF(V8=$AM$9,\"Início do tratamento!\",\"\"))))),\"\")","v":""}]
[null,null,null,null,{"$f":"IF(D8=\"\",\"\",_xlfn._xlws.FILTER(Base!$B:$B,Base!$A:$A=DATE(Calendário!$AA$11,Calendário!$AA$10,Calendário!D8),\"\"))","v":""},null,null,{"$f":"IF(G8=\"\",\"\",_xlfn._xlws.FILTER(Base!$B:$B,Base!$A:$A=DATE(Calendário!$AA$11,Calendário!$AA$10,Calendário!G8),\"\"))","v":""},null,null,{"$f":"IF(J8=\"\",\"\",_xlfn._xlws.FILTER(Base!$B:$B,Base!$A:$A=DATE(Calendário!$AA$11,Calendário!$AA$10,Calendário!J8),\"\"))","v":""},null,null,{"$f":"IF(M8=\"\",\"\",_xlfn._xlws.FILTER(Base!$B:$B,Base!$A:$A=DATE(Calendário!$AA$11,Calendário!$AA$10,Calendário!M8),\"\"))","v":""},null,null,{"$f":"IF(P8=\"\",\"\",_xlfn._xlws.FILTER(Base!$B:$B,Base!$A:$A=DATE(Calendário!$AA$11,Calendário!$AA$10,Calendário!P8),\"\"))","v":""},null,null,{"$f":"IF(S8=\"\",\"\",_xlfn._xlws.FILTER(Base!$B:$B,Base!$A:$A=DATE(Calendário!$AA$11,Calendário!$AA$10,Calendário!S8),\"\"))","v":"19:00 | Puran"},null,null,{"$f":"IF(V8=\"\",\"\",_xlfn._xlws.FILTER(Base!$B:$B,Base!$A:$A=DATE(Calendário!$AA$11,Calendário!$AA$10,Calendário!V8),\"\"))","v":"19:00 | Puran"},null,null,"Dia",{"$f":"DAY(AA7)","v":5},null,"Dia",{"$f":"DAY(AD7)","v":{"$error":"#VALUE!"}},null,"Dia",{"$f":"DAY(AG7)","v":{"$error":"#VALUE!"}},null,"Dia",{"$f":"DAY(AJ7)","v":{"$error":"#VALUE!"}},null,"Dia",{"$f":"DAY(AM7)","v":{"$error":"#VALUE!"}},null,"Dia",{"$f":"DAY(AP7)","v":{"$error":"#VALUE!"}}]
[null,null,null,null,null,null,null,null,null,null,null,null,null,null,null,null,null,null,null,null,null,null,null,null,null,"Mês",{"$f":"MONTH(AA7)","v":12},null,"Mês",{"$f":"MONTH(AD7)","v":{"$error":"#VALUE!"}},null,"Mês",{"$f":"MONTH(AG7)","v":{"$error":"#VALUE!"}},null,"Mês",{"$f":"MONTH(AJ7)","v":{"$error":"#VALUE!"}},null,"Mês",{"$f":"MONTH(AM7)","v":{"$error":"#VALUE!"}},null,"Mês",{"$f":"MONTH(AP7)","v":{"$error":"#VALUE!"}}]
[null,null,null,null,null,null,null,null,null,null,null,null,null,null,null,null,null,null,null,null,null,null,null,null,null,"Ano",{"$f":"YEAR(AA7)","v":2023},null,"Ano",{"$f":"YEAR(AD7)","v":{"$error":"#VALUE!"}},null,"Ano",{"$f":"YEAR(AG7)","v":{"$error":"#VALUE!"}},null,"Ano",{"$f":"YEAR(AJ7)","v":{"$error":"#VALUE!"}},null,"Ano",{"$f":"YEAR(AM7)","v":{"$error":"#VALUE!"}},null,"Ano",{"$f":"YEAR(AP7)","v":{"$error":"#VALUE!"}}]
[null,null,null,null,null,null,null,null,null,null,null,null,null,null,null,null,null,null,null,null,null,null,null,null,null,"Primeiro dia",{"$f":"DATE(AA11,AA10,1)","v":"2023-12-01"},null,"Primeiro dia",{"$f":"DATE(AD11,AD10,1)","v":{"$error":"#VALUE!"}},null,"Primeiro dia",{"$f":"DATE(AG11,AG10,1)","v":{"$error":"#VALUE!"}},null,"Primeiro dia",{"$f":"DATE(AJ11,AJ10,1)","v":{"$error":"#VALUE!"}},null,"Primeiro dia",{"$f":"DATE(AM11,AM10,1)","v":{"$error":"#VALUE!"}},null,"Primeiro dia",{"$f":"DATE(AP11,AP10,1)","v":{"$error":"#VALUE!"}}]
[null,null,null,null,null,null,null,null,null,null,null,null,null,null,null,null,null,null,null,null,null,null,null,null,null,"Dia da Semana",{"$f":"WEEKDAY(AA12)","v":6},null,"Dia da Semana",{"$f":"WEEKDAY(AD12)","v":{"$error":"#VALUE!"}},null,"Dia da Semana",{"$f":"WEEKDAY(AG12)","v":{"$error":"#VALUE!"}},null,"Dia da Semana",{"$f":"WEEKDAY(AJ12)","v":{"$error":"#VALUE!"}},null,"Dia da Semana",{"$f":"WEEKDAY(AM12)","v":{"$error":"#VALUE!"}},null,"Dia da Semana",{"$f":"WEEKDAY(AP12)","v":{"$error":"#VALUE!"}}]
[null,null,null,null,null,null,null,null,null,null,null,null,null,null,null,null,null,null,null,null,null,null,null,null,null,"Último dia",{"$f":"EOMONTH(AA7,0)","v":"2023-12-31"},null,"Último dia",{"$f":"EOMONTH(AD7,0)","v":{"$error":"#VALUE!"}},null,"Último dia",{"$f":"EOMONTH(AG7,0)","v":{"$error":"#VALUE!"}},null,"Último dia",{"$f":"EOMONTH(AJ7,0)","v":{"$error":"#VALUE!"}},null,"Último dia",{"$f":"EOMONTH(AM7,0)","v":{"$error":"#VALUE!"}},null,"Último dia",{"$f":"EOMONTH(AP7,0)","v":{"$error":"#VALUE!"}}]
[null,null,null,{"$f":"V8+1","v":3},{"$f":"IFERROR(IF(D15=$AA$9,\"Início do tratamento!\",IF(D15=$AD$9,\"Início do tratamento!\",IF(D15=$AG$9,\"Início do tratamento!\",IF(D15=$AJ$9,\"Início do tratamento!\",IF(D15=$AM$9,\"Início do tratamento!\",\"\"))))),\"\")","v":""},null,{"$f":"D15+1","v":4},{"$f":"IFERROR(IF(G15=$AA$9,\"Início do tratamento!\",IF(G15=$AD$9,\"Início do tratamento!\",IF(G15=$AG$9,\"Início do tratamento!\",IF(G15=$AJ$9,\"Início do tratamento!\",IF(G15=$AM$9,\"Início do tratamento!\",\"\"))))),\"\")","v":""},null,{"$f":"G15+1","v":5},{"$f":"IFERROR(IF(J15=$AA$9,\"Início do tratamento!\",IF(J15=$AD$9,\"Início do tratamento!\",IF(J15=$AG$9,\"Início do tratamento!\",IF(J15=$AJ$9,\"Início do tratamento!\",IF(J15=$AM$9,\"Início do tratamento!\",\"\"))))),\"\")","v":"Início do tratamento!"},null,{"$f":"J15+1","v":6},{"$f":"IFERROR(IF(M15=$AA$9,\"Início do tratamento!\",IF(M15=$AD$9,\"Início do tratamento!\",IF(M15=$AG$9,\"Início do tratamento!\",IF(M15=$AJ$9,\"Início do tratamento!\",IF(M15=$AM$9,\"Início do tratamento!\",\"\"))))),\"\")","v":""},null,{"$f":"M15+1","v":7},{"$f":"IFERROR(IF(P15=$AA$9,\"Início do tratamento!\",IF(P15=$AD$9,\"Início do tratamento!\",IF(P15=$AG$9,\"Início do tratamento!\",IF(P15=$AJ$9,\"Início do tratamento!\",IF(P15=$AM$9,\"Início do tratamento!\",\"\"))))),\"\")","v":""},null,{"$f":"P15+1","v":8},{"$f":"IFERROR(IF(S15=$AA$9,\"Início do tratamento!\",IF(S15=$AD$9,\"Início do tratamento!\",IF(S15=$AG$9,\"Início do tratamento!\",IF(S15=$AJ$9,\"Início do tratamento!\",IF(S15=$AM$9,\"Início do tratamento!\",\"\"))))),\"\")","v":""},null,{"$f":"S15+1","v":9},{"$f":"IFERROR(IF(V15=$AA$9,\"Início do tratamento!\",IF(V15=$AD$9,\"Início do tratamento!\",IF(V15=$AG$9,\"Início do tratamento!\",IF(V15=$AJ$9,\"Início do tratamento!\",IF(V15=$AM$9,\"Início do tratamento!\",\"\"))))),\"\")","v":""},null,null,"Dia",{"$f":"DAY(AA14)","v":31},null,"Dia",{"$f":"DAY(AD14)","v":{"$error":"#VALUE!"}},null,"Dia",{"$f":"DAY(AG14)","v":{"$error":"#VALUE!"}},null,"Dia",{"$f":"DAY(AJ14)","v":{"$error":"#VALUE!"}},null,"Dia",{"$f":"DAY(AM14)","v":{"$error":"#VALUE!"}},null,"Dia",{"$f":"DAY(AP14)","v":{"$error":"#VALUE!"}}]
[null,null,null,null,{"$f":"IF(D15=\"\",\"\",_xlfn._xlws.FILTER(Base!$B:$B,Base!$A:$A=DATE(Calendário!$AA$11,Calendário!$AA$10,Calendário!D15),\"\"))","v":"19:00 | Puran"},null,null,{"$f":"IF(G15=\"\",\"\",_xlfn._xlws.FILTER(Base!$B:$B,Base!$A:$A=DATE(Calendário!$AA$11,Calendário!$AA$10,Calendário!G15),\"\"))","v":"19:00 | Puran"},null,null,{"$f":"IF(J15=\"\",\"\",_xlfn._xlws.FILTER(Base!$B:$B,Base!$A:$A=DATE(Calendário!$AA$11,Calendário!$AA$10,Calendário!J15),\"\"))","v":"19:00 | Puran"},null,null,{"$f":"IF(M15=\"\",\"\",_xlfn._xlws.FILTER(Base!$B:$B,Base!$A:$A=DATE(Calendário!$AA$11,Calendário!$AA$10,Calendário!M15),\"\"))","v":"19:00 | Puran"},null,null,{"$f":"IF(P15=\"\",\"\",_xlfn._xlws.FILTER(Base!$B:$B,Base!$A:$A=DATE(Calendário!$AA$11,Calendário!$AA$10,Calendário!P15),\"\"))","v":"19:00 | Puran"},null,null,{"$f":"IF(S15=\"\",\"\",_xlfn._xlws.FILTER(Base!$B:$B,Base!$A:$A=DATE(Calendário!$AA$11,Calendário!$AA$10,Calendário!S15),\"\"))","v":"19:00 | Puran"},null,null,{"$f":"IF(V15=\"\",\"\",_xlfn._xlws.FILTER(Base!$B:$B,Base!$A:$A=DATE(Calendário!$AA$11,Calendário!$AA$10,Calendário!V15),\"\"))","v":"19:00 | Puran"}]
[]
[]
[]
[]
[]
[null,null,null,{"$f":"V15+1","v":10},{"$f":"IFERROR(IF(D22=$AA$9,\"Início do tratamento!\",IF(D22=$AD$9,\"Início do tratamento!\",IF(D22=$AG$9,\"Início do tratamento!\",IF(D22=$AJ$9,\"Início do tratamento!\",IF(D22=$AM$9,\"Início do tratamento!\",\"\"))))),\"\")","v":""},null,{"$f":"D22+1","v":11},{"$f":"IFERROR(IF(G22=$AA$9,\"Início do tratamento!\",IF(G22=$AD$9,\"Início do tratamento!\",IF(G22=$AG$9,\"Início do tratamento!\",IF(G22=$AJ$9,\"Início do tratamento!\",IF(G22=$AM$9,\"Início do tratamento!\",\"\"))))),\"\")","v":""},null,{"$f":"G22+1","v":12},{"$f":"IFERROR(IF(J22=$AA$9,\"Início do tratamento!\",IF(J22=$AD$9,\"Início do tratamento!\",IF(J22=$AG$9,\"Início do tratamento!\",IF(J22=$AJ$9,\"Início do tratamento!\",IF(J22=$AM$9,\"Início do tratamento!\",\"\"))))),\"\")","v":""},null,{"$f":"J22+1","v":13},{"$f":"IFERROR(IF(M22=$AA$9,\"Início do tratamento!\",IF(M22=$AD$9,\"Início do tratamento!\",IF(M22=$AG$9,\"Início do tratamento!\",IF(M22=$AJ$9,\"Início do tratamento!\",IF(M22=$AM$9,\"Início do tratamento!\",\"\"))))),\"\")","v":""},null,{"$f":"M22+1","v":14},{"$f":"IFERROR(IF(P22=$AA$9,\"Início do tratamento!\",IF(P22=$AD$9,\"Início do tratamento!\",IF(P22=$AG$9,\"Início do tratamento!\",IF(P22=$AJ$9,\"Início do tratamento!\",IF(P22=$AM$9,\"Início do tratamento!\",\"\"))))),\"\")","v":""},null,{"$f":"P22+1","v":15},{"$f":"IFERROR(IF(S22=$AA$9,\"Início do tratamento!\",IF(S22=$AD$9,\"Início do tratamento!\",IF(S22=$AG$9,\"Início do tratamento!\",IF(S22=$AJ$9,\"Início do tratamento!\",IF(S22=$AM$9,\"Início do tratamento!\",\"\"))))),\"\")","v":""},null,{"$f":"S22+1","v":16},{"$f":"IFERROR(IF(V22=$AA$9,\"Início do tratamento!\",IF(V22=$AD$9,\"Início do tratamento!\",IF(V22=$AG$9,\"Início do tratamento!\",IF(V22=$AJ$9,\"Início do tratamento!\",IF(V22=$AM$9,\"Início do tratamento!\",\"\"))))),\"\")","v":""}]
[null,null,null,null,{"$f":"IF(D22=\"\",\"\",_xlfn._xlws.FILTER(Base!$B:$B,Base!$A:$A=DATE(Calendário!$AA$11,Calendário!$AA$10,Calendário!D22),\"\"))","v":"19:00 | Puran"},null,null,{"$f":"IF(G22=\"\",\"\",_xlfn._xlws.FILTER(Base!$B:$B,Base!$A:$A=DATE(Calendário!$AA$11,Calendário!$AA$10,Calendário!G22),\"\"))","v":"19:00 | Puran"},null,null,{"$f":"IF(J22=\"\",\"\",_xlfn._xlws.FILTER(Base!$B:$B,Base!$A:$A=DATE(Calendário!$AA$11,Calendário!$AA$10,Calendário!J22),\"\"))","v":"19:00 | Puran"},null,null,{"$f":"IF(M22=\"\",\"\",_xlfn._xlws.FILTER(Base!$B:$B,Base!$A:$A=DATE(Calendário!$AA$11,Calendário!$AA$10,Calendário!M22),\"\"))","v":"19:00 | Puran"},null,null,{"$f":"IF(P22=\"\",\"\",_xlfn._xlws.FILTER(Base!$B:$B,Base!$A:$A=DATE(Calendário!$AA$11,Calendário!$AA$10,Calendário!P22),\"\"))","v":"19:00 | Puran"},null,null,{"$f":"IF(S22=\"\",\"\",_xlfn._xlws.FILTER(Base!$B:$B,Base!$A:$A=DATE(Calendário!$AA$11,Calendário!$AA$10,Calendário!S22),\"\"))","v":"19:00 | Puran"},null,null,{"$f":"IF(V22=\"\",\"\",_xlfn._xlws.FILTER(Base!$B:$B,Base!$A:$A=DATE(Calendário!$AA$11,Calendário!$AA$10,Calendário!V22),\"\"))","v":"19:00 | Puran"}]
[]
[]
[]
[]
[]
[null,null,null,{"$f":"V22+1","v":17},{"$f":"IFERROR(IF(D29=$AA$9,\"Início do tratamento!\",IF(D29=$AD$9,\"Início do tratamento!\",IF(D29=$AG$9,\"Início do tratamento!\",IF(D29=$AJ$9,\"Início do tratamento!\",IF(D29=$AM$9,\"Início do tratamento!\",\"\"))))),\"\")","v":""},null,{"$f":"D29+1","v":18},{"$f":"IFERROR(IF(G29=$AA$9,\"Início do tratamento!\",IF(G29=$AD$9,\"Início do tratamento!\",IF(G29=$AG$9,\"Início do tratamento!\",IF(G29=$AJ$9,\"Início do tratamento!\",IF(G29=$AM$9,\"Início do tratamento!\",\"\"))))),\"\")","v":""},null,{"$f":"G29+1","v":19},{"$f":"IFERROR(IF(J29=$AA$9,\"Início do tratamento!\",IF(J29=$AD$9,\"Início do tratamento!\",IF(J29=$AG$9,\"Início do tratamento!\",IF(J29=$AJ$9,\"Início do tratamento!\",IF(J29=$AM$9,\"Início do tratamento!\",\"\"))))),\"\")","v":""},null,{"$f":"J29+1","v":20},{"$f":"IFERROR(IF(M29=$AA$9,\"Início do tratamento!\",IF(M29=$AD$9,\"Início do tratamento!\",IF(M29=$AG$9,\"Início do tratamento!\",IF(M29=$AJ$9,\"Início do tratamento!\",IF(M29=$AM$9,\"Início do tratamento!\",\"\"))))),\"\")","v":""},null,{"$f":"M29+1","v":21},{"$f":"IFERROR(IF(P29=$AA$9,\"Início do tratamento!\",IF(P29=$AD$9,\"Início do tratamento!\",IF(P29=$AG$9,\"Início do tratamento!\",IF(P29=$AJ$9,\"Início do tratamento!\",IF(P29=$AM$9,\"Início do tratamento!\",\"\"))))),\"\")","v":""},null,{"$f":"P29+1","v":22},{"$f":"IFERROR(IF(S29=$AA$9,\"Início do tratamento!\",IF(S29=$AD$9,\"Início do tratamento!\",IF(S29=$AG$9,\"Início do tratamento!\",IF(S29=$AJ$9,\"Início do tratamento!\",IF(S29=$AM$9,\"Início do tratamento!\",\"\"))))),\"\")","v":""},null,{"$f":"S29+1","v":23},{"$f":"IFERROR(IF(V29=$AA$9,\"Início do tratamento!\",IF(V29=$AD$9,\"Início do tratamento!\",IF(V29=$AG$9,\"Início do tratamento!\",IF(V29=$AJ$9,\"Início do tratamento!\",IF(V29=$AM$9,\"Início do tratamento!\",\"\"))))),\"\")","v":""}]
[null,null,null,null,{"$f":"IF(D29=\"\",\"\",_xlfn._xlws.FILTER(Base!$B:$B,Base!$A:$A=DATE(Calendário!$AA$11,Calendário!$AA$10,Calendário!D29),\"\"))","v":"19:00 | Puran"},null,null,{"$f":"IF(G29=\"\",\"\",_xlfn._xlws.FILTER(Base!$B:$B,Base!$A:$A=DATE(Calendário!$AA$11,Calendário!$AA$10,Calendário!G29),\"\"))","v":"19:00 | Puran"},null,null,{"$f":"IF(J29=\"\",\"\",_xlfn._xlws.FILTER(Base!$B:$B,Base!$A:$A=DATE(Calendário!$AA$11,Calendário!$AA$10,Calendário!J29),\"\"))","v":"19:00 | Puran"},null,null,{"$f":"IF(M29=\"\",\"\",_xlfn._xlws.FILTER(Base!$B:$B,Base!$A:$A=DATE(Calendário!$AA$11,Calendário!$AA$10,Calendário!M29),\"\"))","v":"19:00 | Puran"},null,null,{"$f":"IF(P29=\"\",\"\",_xlfn._xlws.FILTER(Base!$B:$B,Base!$A:$A=DATE(Calendário!$AA$11,Calendário!$AA$10,Calendário!P29),\"\"))","v":"19:00 | Puran"},null,null,{"$f":"IF(S29=\"\",\"\",_xlfn._xlws.FILTER(Base!$B:$B,Base!$A:$A=DATE(Calendário!$AA$11,Calendário!$AA$10,Calendário!S29),\"\"))","v":"19:00 | Puran"},null,null,{"$f":"IF(V29=\"\",\"\",_xlfn._xlws.FILTER(Base!$B:$B,Base!$A:$A=DATE(Calendário!$AA$11,Calendário!$AA$10,Calendário!V29),\"\"))","v":"19:00 | Puran"}]
[]
[]
[]
[]
[]
[null,null,null,{"$f":"IF(V29=\"\",\"\",IF(V29+1>$AA$15,\"\",V29+1))","v":24},{"$f":"IFERROR(IF(D36=$AA$9,\"Início do tratamento!\",IF(D36=$AD$9,\"Início do tratamento!\",IF(D36=$AG$9,\"Início do tratamento!\",IF(D36=$AJ$9,\"Início do tratamento!\",IF(D36=$AM$9,\"Início do tratamento!\",\"\"))))),\"\")","v":""},null,{"$f":"IF(D36=\"\",\"\",IF(D36+1>$AA$15,\"\",D36+1))","v":25},{"$f":"IFERROR(IF(G36=$AA$9,\"Início do tratamento!\",IF(G36=$AD$9,\"Início do tratamento!\",IF(G36=$AG$9,\"Início do tratamento!\",IF(G36=$AJ$9,\"Início do tratamento!\",IF(G36=$AM$9,\"Início do tratamento!\",\"\"))))),\"\")","v":""},null,{"$f":"IF(G36=\"\",\"\",IF(G36+1>$AA$15,\"\",G36+1))","v":26},{"$f":"IFERROR(IF(J36=$AA$9,\"Início do tratamento!\",IF(J36=$AD$9,\"Início do tratamento!\",IF(J36=$AG$9,\"Início do tratamento!\",IF(J36=$AJ$9,\"Início do tratamento!\",IF(J36=$AM$9,\"Início do tratamento!\",\"\"))))),\"\")","v":""},null,{"$f":"IF(J36=\"\",\"\",IF(J36+1>$AA$15,\"\",J36+1))","v":27},{"$f":"IFERROR(IF(M36=$AA$9,\"Início do tratamento!\",IF(M36=$AD$9,\"Início do tratamento!\",IF(M36=$AG$9,\"Início do tratamento!\",IF(M36=$AJ$9,\"Início do tratamento!\",IF(M36=$AM$9,\"Início do tratamento!\",\"\"))))),\"\")","v":""},null,{"$f":"IF(M36=\"\",\"\",IF(M36+1>$AA$15,\"\",M36+1))","v":28},{"$f":"IFERROR(IF(P36=$AA$9,\"Início do tratamento!\",IF(P36=$AD$9,\"Início do tratamento!\",IF(P36=$AG$9,\"Início do tratamento!\",IF(P36=$AJ$9,\"Início do tratamento!\",IF(P36=$AM$9,\"Início do tratamento!\",\"\"))))),\"\")","v":""},null,{"$f":"IF(P36=\"\",\"\",IF(P36+1>$AA$15,\"\",P36+1))","v":29},{"$f":"IFERROR(IF(S36=$AA$9,\"Início do tratamento!\",IF(S36=$AD$9,\"Início do tratamento!\",IF(S36=$AG$9,\"Início do tratamento!\",IF(S36=$AJ$9,\"Início do tratamento!\",IF(S36=$AM$9,\"Início do tratamento!\",\"\"))))),\"\")","v":""},null,{"$f":"IF(S36=\"\",\"\",IF(S36+1>$AA$15,\"\",S36+1))","v":30},{"$f":"IFERROR(IF(V36=$AA$9,\"Início do tratamento!\",IF(V36=$AD$9,\"Início do tratamento!\",IF(V36=$AG$9,\"Início do tratamento!\",IF(V36=$AJ$9,\"Início do tratamento!\",IF(V36=$AM$9,\"Início do tratamento!\",\"\"))))),\"\")","v":""}]
[null,null,null,null,{"$f":"IF(D36=\"\",\"\",_xlfn._xlws.FILTER(Base!$B:$B,Base!$A:$A=DATE(Calendário!$AA$11,Calendário!$AA$10,Calendário!D36),\"\"))","v":"19:00 | Puran"},null,null,{"$f":"IF(G36=\"\",\"\",_xlfn._xlws.FILTER(Base!$B:$B,Base!$A:$A=DATE(Calendário!$AA$11,Calendário!$AA$10,Calendário!G36),\"\"))","v":"19:00 | Puran"},null,null,{"$f":"IF(J36=\"\",\"\",_xlfn._xlws.FILTER(Base!$B:$B,Base!$A:$A=DATE(Calendário!$AA$11,Calendário!$AA$10,Calendário!J36),\"\"))","v":"19:00 | Puran"},null,null,{"$f":"IF(M36=\"\",\"\",_xlfn._xlws.FILTER(Base!$B:$B,Base!$A:$A=DATE(Calendário!$AA$11,Calendário!$AA$10,Calendário!M36),\"\"))","v":"19:00 | Puran"},null,null,{"$f":"IF(P36=\"\",\"\",_xlfn._xlws.FILTER(Base!$B:$B,Base!$A:$A=DATE(Calendário!$AA$11,Calendário!$AA$10,Calendário!P36),\"\"))","v":"19:00 | Puran"},null,null,{"$f":"IF(S36=\"\",\"\",_xlfn._xlws.FILTER(Base!$B:$B,Base!$A:$A=DATE(Calendário!$AA$11,Calendário!$AA$10,Calendário!S36),\"\"))","v":""},null,null,{"$f":"IF(V36=\"\",\"\",_xlfn._xlws.FILTER(Base!$B:$B,Base!$A:$A=DATE(Calendário!$AA$11,Calendário!$AA$10,Calendário!V36),\"\"))","v":""}]
[]
[]
[]
[]
[]
[null,null,null,{"$f":"IF(V36=\"\",\"\",IF(V36+1>$AA$15,\"\",V36+1))","v":31},{"$f":"IFERROR(IF(D43=$AA$9,\"Início do tratamento!\",IF(D43=$AD$9,\"Início do tratamento!\",IF(D43=$AG$9,\"Início do tratamento!\",IF(D43=$AJ$9,\"Início do tratamento!\",IF(D43=$AM$9,\"Início do tratamento!\",\"\"))))),\"\")","v":""},null,{"$f":"IF(D43=\"\",\"\",IF(D43+1>$AA$15,\"\",D43+1))","v":""},{"$f":"IFERROR(IF(G43=$AA$9,\"Início do tratamento!\",IF(G43=$AD$9,\"Início do tratamento!\",IF(G43=$AG$9,\"Início do tratamento!\",IF(G43=$AJ$9,\"Início do tratamento!\",IF(G43=$AM$9,\"Início do tratamento!\",\"\"))))),\"\")","v":""},null,{"$f":"IF(G43=\"\",\"\",IF(G43+1>$AA$15,\"\",G43+1))","v":""},{"$f":"IFERROR(IF(J43=$AA$9,\"Início do tratamento!\",IF(J43=$AD$9,\"Início do tratamento!\",IF(J43=$AG$9,\"Início do tratamento!\",IF(J43=$AJ$9,\"Início do tratamento!\",IF(J43=$AM$9,\"Início do tratamento!\",\"\"))))),\"\")","v":""},null,{"$f":"IF(J43=\"\",\"\",IF(J43+1>$AA$15,\"\",J43+1))","v":""},{"$f":"IFERROR(IF(M43=$AA$9,\"Início do tratamento!\",IF(M43=$AD$9,\"Início do tratamento!\",IF(M43=$AG$9,\"Início do tratamento!\",IF(M43=$AJ$9,\"Início do tratamento!\",IF(M43=$AM$9,\"Início do tratamento!\",\"\"))))),\"\")","v":""},null,{"$f":"IF(M43=\"\",\"\",IF(M43+1>$AA$15,\"\",M43+1))","v":""},{"$f":"IFERROR(IF(P43=$AA$9,\"Início do tratamento!\",IF(P43=$AD$9,\"Início do tratamento!\",IF(P43=$AG$9,\"Início do tratamento!\",IF(P43=$AJ$9,\"Início do tratamento!\",IF(P43=$AM$9,\"Início do tratamento!\",\"\"))))),\"\")","v":""},null,{"$f":"IF(P43=\"\",\"\",IF(P43+1>$AA$15,\"\",P43+1))","v":""},{"$f":"IFERROR(IF(S43=$AA$9,\"Início do tratamento!\",IF(S43=$AD$9,\"Início do tratamento!\",IF(S43=$AG$9,\"Início do tratamento!\",IF(S43=$AJ$9,\"Início do tratamento!\",IF(S43=$AM$9,\"Início do tratamento!\",\"\"))))),\"\")","v":""},null,{"$f":"IF(S43=\"\",\"\",IF(S43+1>$AA$15,\"\",S43+1))","v":""},{"$f":"IFERROR(IF(V43=$AA$9,\"Início do tratamento!\",IF(V43=$AD$9,\"Início do tratamento!\",IF(V43=$AG$9,\"Início do tratamento!\",IF(V43=$AJ$9,\"Início do tratamento!\",IF(V43=$AM$9,\"Início do tratamento!\",\"\"))))),\"\")","v":""}]
[null,null,null,null,{"$f":"IF(D43=\"\",\"\",_xlfn._xlws.FILTER(Base!$B:$B,Base!$A:$A=DATE(Calendário!$AA$11,Calendário!$AA$10,Calendário!D43),\"\"))","v":""},null,null,{"$f":"IF(G43=\"\",\"\",_xlfn._xlws.FILTER(Base!$B:$B,Base!$A:$A=DATE(Calendário!$AA$11,Calendário!$AA$10,Calendário!G43),\"\"))","v":""},null,null,{"$f":"IF(J43=\"\",\"\",_xlfn._xlws.FILTER(Base!$B:$B,Base!$A:$A=DATE(Calendário!$AA$11,Calendário!$AA$10,Calendário!J43),\"\"))","v":""},null,null,{"$f":"IF(M43=\"\",\"\",_xlfn._xlws.FILTER(Base!$B:$B,Base!$A:$A=DATE(Calendário!$AA$11,Calendário!$AA$10,Calendário!M43),\"\"))","v":""},null,null,{"$f":"IF(P43=\"\",\"\",_xlfn._xlws.FILTER(Base!$B:$B,Base!$A:$A=DATE(Calendário!$AA$11,Calendário!$AA$10,Calendário!P43),\"\"))","v":""},null,null,{"$f":"IF(S43=\"\",\"\",_xlfn._xlws.FILTER(Base!$B:$B,Base!$A:$A=DATE(Calendário!$AA$11,Calendário!$AA$10,Calendário!S43),\"\"))","v":""},null,null,{"$f":"IF(V43=\"\",\"\",_xlfn._xlws.FILTER(Base!$B:$B,Base!$A:$A=DATE(Calendário!$AA$11,Calendário!$AA$10,Calendário!V43),\"\"))","v":""}]
[]
[]
[]
[]
[]
[]
[]
[null,null,null,"Anotações"]
[]
[]
[]
[]
[]
[]
[]
[]
[]
[]
[]
[]
[]
[]
[]
[]
[]
[null,null,null,{"$f":"_xlfn.XLOOKUP(AA75,Base!$T$5:$T$16,Base!$U$5:$U$16,\"\",0,1)&\"|\"&AA76","v":"JANEIRO|2024"}]
[null,null,null,1,null,null,2,null,null,3,null,null,4,null,null,5,null,null,6,null,null,7]
[null,null,null,"Domingo",null,null,"Segunda-feira",null,null,"Terça-feira",null,null,"Quarta-feira",null,null,"Quinta-feira",null,null,"Sexta-feira",null,null,"Sábado"]
[null,null,null,{"$f":"IF(D71=AA78,1,IF(C74=\"\",\"\",C74+1))","v":""},null,null,{"$f":"IF(G71=AA78,1,IF(D73=\"\",\"\",D73+1))","v":1},null,null,{"$f":"IF(J71=AA78,1,IF(G73=\"\",\"\",G73+1))","v":2},null,null,{"$f":"IF(M71=AA78,1,IF(J73=\"\",\"\",J73+1))","v":3},null,null,{"$f":"IF(P71=AA78,1,IF(M73=\"\",\"\",M73+1))","v":4},null,null,{"$f":"IF(S71=AA78,1,IF(P73=\"\",\"\",P73+1))","v":5},null,null,{"$f":"IF(V71=AA78,1,IF(S73=\"\",\"\",S73+1))","v":6}]
[null,null,null,null,{"$f":"IF(D73=\"\",\"\",_xlfn._xlws.FILTER(Base!$B:$B,Base!$A:$A=DATE(Calendário!AA76,Calendário!AA75,Calendário!D73),\"\"))","v":""},null,null,{"$f":"IF(G73=\"\",\"\",_xlfn._xlws.FILTER(Base!$B:$B,Base!$A:$A=DATE(Calendário!AA76,Calendário!AA75,Calendário!G73),\"\"))","v":""},null,null,{"$f":"IF(J73=\"\",\"\",_xlfn._xlws.FILTER(Base!$B:$B,Base!$A:$A=DATE(Calendário!AA76,Calendário!AA75,Calendário!J73),\"\"))","v":""},null,null,{"$f":"IF(M73=\"\",\"\",_xlfn._xlws.FILTER(Base!$B:$B,Base!$A:$A=DATE(Calendário!AA76,Calendário!AA75,Calendário!M73),\"\"))","v":""},null,null,{"$f":"IF(P73=\"\",\"\",_xlfn._xlws.FILTER(Base!$B:$B,Base!$A:$A=DATE(Calendário!AA76,Calendário!AA75,Calendário!P73),\"\"))","v":""},null,null,{"$f":"IF(S73=\"\",\"\",_xlfn._xlws.FILTER(Base!$B:$B,Base!$A:$A=DATE(Calendário!AA76,Calendário!AA75,Calendário!S73),\"\"))","v":""},null,null,{"$f":"IF(V73=\"\",\"\",_xlfn._xlws.FILTER(Base!$B:$B,Base!$A:$A=DATE(Calendário!AA76,Calendário!AA75,Calendário!V73),\"\"))","v":""},null,null,"Dia",1]
[null,null,null,null,null,null,null,null,null,null,null,null,null,null,null,null,null,null,null,null,null,null,null,null,null,"Mês",{"$f":"IF((AA10+1)>12,1,AA10+1)","v":1}]
[null,null,null,null,null,null,null,null,null,null,null,null,null,null,null,null,null,null,null,null,null,null,null,null,null,"Ano",{"$f":"IF((AA10+1)>12,AA11+1,AA11)","v":2024}]
[null,null,null,null,null,null,null,null,null,null,null,null,null,null,null,null,null,null,null,null,null,null,null,null,null,"Primeiro dia",{"$f":"DATE(AA76,AA75,1)","v":"2024-01-01"}]
[null,null,null,null,null,null,null,null,null,null,null,null,null,null,null,null,null,null,null,null,null,null,null,null,null,"Dia da Semana",{"$f":"WEEKDAY(AA77)","v":2}]
[null,null,null,null,null,null,null,null,null,null,null,null,null,null,null,null,null,null,null,null,null,null,null,null,null,"Último dia",{"$f":"EOMONTH(AA77,0)","v":"2024-01-31"}]
[null,null,null,{"$f":"V73+1","v":7},null,null,{"$f":"D80+1","v":8},null,null,{"$f":"G80+1","v":9},null,null,{"$f":"J80+1","v":10},null,null,{"$f":"M80+1","v":11},null,null,{"$f":"P80+1","v":12},null,null,{"$f":"S80+1","v":13},null,null,null,"Dia",{"$f":"DAY(AA79)","v":31}]
[null,null,null,null,{"$f":"IF(D80=\"\",\"\",_xlfn._xlws.FILTER(Base!$B:$B,Base!$A:$A=DATE(Calendário!AA76,Calendário!AA75,Calendário!D80),\"\"))","v":""},null,null,{"$f":"IF(G80=\"\",\"\",_xlfn._xlws.FILTER(Base!$B:$B,Base!$A:$A=DATE(Calendário!AA76,Calendário!AA75,Calendário!G80),\"\"))","v":""},null,null,{"$f":"IF(J80=\"\",\"\",_xlfn._xlws.FILTER(Base!$B:$B,Base!$A:$A=DATE(Calendário!AA76,Calendário!AA75,Calendário!J80),\"\"))","v":""},null,null,{"$f":"IF(M80=\"\",\"\",_xlfn._xlws.FILTER(Base!$B:$B,Base!$A:$A=DATE(Calendário!AA76,Calendário!AA75,Calendário!M80),\"\"))","v":""},null,null,{"$f":"IF(P80=\"\",\"\",_xlfn._xlws.FILTER(Base!$B:$B,Base!$A:$A=DATE(Calendário!AA76,Calendário!AA75,Calendário!P80),\"\"))","v":""},null,null,{"$f":"IF(S80=\"\",\"\",_xlfn._xlws.FILTER(Base!$B:$B,Base!$A:$A=DATE(Calendário!AA76,Calendário!AA75,Calendário!S80),\"\"))","v":""},null,null,{"$f":"IF(V80=\"\",\"\",_xlfn._xlws.FILTER(Base!$B:$B,Base!$A:$A=DATE(Calendário!AA76,Calendário!AA75,Calendário!V80),\"\"))","v":""}]
[]
[]
[]
[]
[]
[null,null,null,{"$f":"V80+1","v":14},null,null,{"$f":"D87+1","v":15},null,null,{"$f":"G87+1","v":16},null,null,{"$f":"J87+1","v":17},null,null,{"$f":"M87+1","v":18},null,null,{"$f":"P87+1","v":19},null,null,{"$f":"S87+1","v":20}]
[null,null,null,null,{"$f":"IF(D87=\"\",\"\",_xlfn._xlws.FILTER(Base!$B:$B,Base!$A:$A=DATE(Calendário!AA76,Calendário!AA75,Calendário!D87),\"\"))","v":""},null,null,{"$f":"IF(G87=\"\",\"\",_xlfn._xlws.FILTER(Base!$B:$B,Base!$A:$A=DATE(Calendário!AA76,Calendário!AA75,Calendário!G87),\"\"))","v":""},null,null,{"$f":"IF(J87=\"\",\"\",_xlfn._xlws.FILTER(Base!$B:$B,Base!$A:$A=DATE(Calendário!AA76,Calendário!AA75,Calendário!J87),\"\"))","v":""},null,null,{"$f":"IF(M87=\"\",\"\",_xlfn._xlws.FILTER(Base!$B:$B,Base!$A:$A=DATE(Calendário!AA76,Calendário!AA75,Calendário!M87),\"\"))","v":""},null,null,{"$f":"IF(P87=\"\",\"\",_xlfn._xlws.FILTER(Base!$B:$B,Base!$A:$A=DATE(Calendário!AA76,Calendário!AA75,Calendário!P87),\"\"))","v":""},null,null,{"$f":"IF(S87=\"\",\"\",_xlfn._xlws.FILTER(Base!$B:$B,Base!$A:$A=DATE(Calendário!AA76,Calendário!AA75,Calendário!S87),\"\"))","v":""},null,null,{"$f":"IF(V87=\"\",\"\",_xlfn._xlws.FILTER(Base!$B:$B,Base!$A:$A=DATE(Calendário!AA76,Calendário!AA75,Calendário!V87),\"\"))","v":""}]
[]
[]
[]
[]
[]
[null,null,null,{"$f":"V87+1","v":21},null,null,{"$f":"D94+1","v":22},null,null,{"$f":"G94+1","v":23},null,null,{"$f":"J94+1","v":24},null,null,{"$f":"M94+1","v":25},null,null,{"$f":"P94+1","v":26},null,null,{"$f":"S94+1","v":27}]
[null,null,null,null,{"$f":"IF(D94=\"\",\"\",_xlfn._xlws.FILTER(Base!$B:$B,Base!$A:$A=DATE(Calendário!AA76,Calendário!AA75,Calendário!D94),\"\"))","v":""},null,null,{"$f":"IF(G94=\"\",\"\",_xlfn._xlws.FILTER(Base!$B:$B,Base!$A:$A=DATE(Calendário!AA76,Calendário!AA75,Calendário!G94),\"\"))","v":""},null,null,{"$f":"IF(J94=\"\",\"\",_xlfn._xlws.FILTER(Base!$B:$B,Base!$A:$A=DATE(Calendário!AA76,Calendário!AA75,Calendário!J94),\"\"))","v":""},null,null,{"$f":"IF(M94=\"\",\"\",_xlfn._xlws.FILTER(Base!$B:$B,Base!$A:$A=DATE(Calendário!AA76,Calendário!AA75,Calendário!M94),\"\"))","v":""},null,null,{"$f":"IF(P94=\"\",\"\",_xlfn._xlws.FILTER(Base!$B:$B,Base!$A:$A=DATE(Calendário!AA76,Calendário!AA75,Calendário!P94),\"\"))","v":""},null,null,{"$f":"IF(S94=\"\",\"\",_xlfn._xlws.FILTER(Base!$B:$B,Base!$A:$A=DATE(Calendário!AA76,Calendário!AA75,Calendário!S94),\"\"))","v":""},null,null,{"$f":"IF(V94=\"\",\"\",_xlfn._xlws.FILTER(Base!$B:$B,Base!$A:$A=DATE(Calendário!AA76,Calendário!AA75,Calendário!V94),\"\"))","v":""}]
[]
[]
[]
[]
[]
[null,null,null,{"$f":"IF(V94=\"\",\"\",IF(V94+1>AA80,\"\",V94+1))","v":28},null,null,{"$f":"IF(D101=\"\",\"\",IF(D101+1>AA80,\"\",D101+1))","v":29},null,null,{"$f":"IF(G101=\"\",\"\",IF(G101+1>AA80,\"\",G101+1))","v":30},null,null,{"$f":"IF(J101=\"\",\"\",IF(J101+1>AA80,\"\",J101+1))","v":31},null,null,{"$f":"IF(M101=\"\",\"\",IF(M101+1>AA80,\"\",M101+1))","v":""},null,null,{"$f":"IF(P101=\"\",\"\",IF(P101+1>AA80,\"\",P101+1))","v":""},null,null,{"$f":"IF(S101=\"\",\"\",IF(S101+1>AA80,\"\",S101+1))","v":""}]
[null,null,null,null,{"$f":"IF(D101=\"\",\"\",_xlfn._xlws.FILTER(Base!$B:$B,Base!$A:$A=DATE(Calendário!AA76,Calendário!AA75,Calendário!D101),\"\"))","v":""},null,null,{"$f":"IF(G101=\"\",\"\",_xlfn._xlws.FILTER(Base!$B:$B,Base!$A:$A=DATE(Calendário!AA76,Calendário!AA75,Calendário!G101),\"\"))","v":""},null,null,{"$f":"IF(J101=\"\",\"\",_xlfn._xlws.FILTER(Base!$B:$B,Base!$A:$A=DATE(Calendário!AA76,Calendário!AA75,Calendário!J101),\"\"))","v":""},null,null,{"$f":"IF(M101=\"\",\"\",_xlfn._xlws.FILTER(Base!$B:$B,Base!$A:$A=DATE(Calendário!AA76,Calendário!AA75,Calendário!M101),\"\"))","v":""},null,null,{"$f":"IF(P101=\"\",\"\",_xlfn._xlws.FILTER(Base!$B:$B,Base!$A:$A=DATE(Calendário!AA76,Calendário!AA75,Calendário!P101),\"\"))","v":""},null,null,{"$f":"IF(S101=\"\",\"\",_xlfn._xlws.FILTER(Base!$B:$B,Base!$A:$A=DATE(Calendário!AA76,Calendário!AA75,Calendário!S101),\"\"))","v":""},null,null,{"$f":"IF(V101=\"\",\"\",_xlfn._xlws.FILTER(Base!$B:$B,Base!$A:$A=DATE(Calendário!AA76,Calendário!AA75,Calendário!V101),\"\"))","v":""}]
[]
[]
[]
[]
[]
[null,null,null,{"$f":"IF(V101=\"\",\"\",IF(V101+1>AA80,\"\",V101+1))","v":""},null,null,{"$f":"IF(D108=\"\",\"\",IF(D108+1>AA80,\"\",D108+1))","v":""},null,null,{"$f":"IF(G108=\"\",\"\",IF(G108+1>AA80,\"\",G108+1))","v":""},null,null,{"$f":"IF(J108=\"\",\"\",IF(J108+1>AA80,\"\",J108+1))","v":""},null,null,{"$f":"IF(M108=\"\",\"\",IF(M108+1>AA80,\"\",M108+1))","v":""},null,null,{"$f":"IF(P108=\"\",\"\",IF(P108+1>AA80,\"\",P108+1))","v":""},null,null,{"$f":"IF(S108=\"\",\"\",IF(S108+1>AA80,\"\",S108+1))","v":""}]
[null,null,null,null,{"$f":"IF(D108=\"\",\"\",_xlfn._xlws.FILTER(Base!$B:$B,Base!$A:$A=DATE(Calendário!AA76,Calendário!AA75,Calendário!D108),\"\"))","v":""},null,null,{"$f":"IF(G108=\"\",\"\",_xlfn._xlws.FILTER(Base!$B:$B,Base!$A:$A=DATE(Calendário!AA76,Calendário!AA75,Calendário!G108),\"\"))","v":""},null,null,{"$f":"IF(J108=\"\",\"\",_xlfn._xlws.FILTER(Base!$B:$B,Base!$A:$A=DATE(Calendário!AA76,Calendário!AA75,Calendário!J108),\"\"))","v":""},null,null,{"$f":"IF(M108=\"\",\"\",_xlfn._xlws.FILTER(Base!$B:$B,Base!$A:$A=DATE(Calendário!AA76,Calendário!AA75,Calendário!M108),\"\"))","v":""},null,null,{"$f":"IF(P108=\"\",\"\",_xlfn._xlws.FILTER(Base!$B:$B,Base!$A:$A=DATE(Calendário!AA76,Calendário!AA75,Calendário!P108),\"\"))","v":""},null,null,{"$f":"IF(S108=\"\",\"\",_xlfn._xlws.FILTER(Base!$B:$B,Base!$A:$A=DATE(Calendário!AA76,Calendário!AA75,Calendário!S108),\"\"))","v":""},null,null,{"$f":"IF(V108=\"\",\"\",_xlfn._xlws.FILTER(Base!$B:$B,Base!$A:$A=DATE(Calendário!AA76,Calendário!AA75,Calendário!V108),\"\"))","v":""}]
[]
[]
[]
[]
[]
[]
[]
[null,null,null,"Anotações"]
[]
[]
[]
[]
[]
[]
[]
[]
[]
[]
[]
[]
[]
[]
[]
[]
[]
[null,null,null,{"$f":"_xlfn.XLOOKUP(AA140,Base!$T$5:$T$16,Base!$U$5:$U$16,\"\",0,1)&\"|\"&AA141","v":"FEVEREIRO|2024"}]
[null,null,null,1,null,null,2,null,null,3,null,null,4,null,null,5,null,null,6,null,null,7]
[null,null,null,"Domingo",null,null,"Segunda-feira",null,null,"Terça-feira",null,null,"Quarta-feira",null,null,"Quinta-feira",null,null,"Sexta-feira",null,null,"Sábado"]
[null,null,null,{"$f":"IF(D136=AA143,1,IF(C139=\"\",\"\",C139+1))","v":""},null,null,{"$f":"IF(G136=AA143,1,IF(D138=\"\",\"\",D138+1))","v":""},null,null,{"$f":"IF(J136=AA143,1,IF(G138=\"\",\"\",G138+1))","v":""},null,null,{"$f":"IF(M136=AA143,1,IF(J138=\"\",\"\",J138+1))","v":""},null,null,{"$f":"IF(P136=AA143,1,IF(M138=\"\",\"\",M138+1))","v":1},null,null,{"$f":"IF(S136=AA143,1,IF(P138=\"\",\"\",P138+1))","v":2},null,null,{"$f":"IF(V136=AA143,1,IF(S138=\"\",\"\",S138+1))","v":3}]
[null,null,null,null,{"$f":"IF(D138=\"\",\"\",_xlfn._xlws.FILTER(Base!$B:$B,Base!$A:$A=DATE(Calendário!AA141,Calendário!AA140,Calendário!D138),\"\"))","v":""},null,null,{"$f":"IF(G138=\"\",\"\",_xlfn._xlws.FILTER(Base!$B:$B,Base!$A:$A=DATE(Calendário!AA141,Calendário!AA140,Calendário!G138),\"\"))","v":""},null,null,{"$f":"IF(J138=\"\",\"\",_xlfn._xlws.FILTER(Base!$B:$B,Base!$A:$A=DATE(Calendário!AA141,Calendário!AA140,Calendário!J138),\"\"))","v":""},null,null,{"$f":"IF(M138=\"\",\"\",_xlfn._xlws.FILTER(Base!$B:$B,Base!$A:$A=DATE(Calendário!AA141,Calendário!AA140,Calendário!M138),\"\"))","v":""},null,null,{"$f":"IF(P138=\"\",\"\",_xlfn._xlws.FILTER(Base!$B:$B,Base!$A:$A=DATE(Calendário!AA141,Calendário!AA140,Calendário!P138),\"\"))","v":""},null,null,{"$f":"IF(S138=\"\",\"\",_xlfn._xlws.FILTER(Base!$B:$B,Base!$A:$A=DATE(Calendário!AA141,Calendário!AA140,Calendário!S138),\"\"))","v":""},null,null,{"$f":"IF(V138=\"\",\"\",_xlfn._xlws.FILTER(Base!$B:$B,Base!$A:$A=DATE(Calendário!AA141,Calendário!AA140,Calendário!V138),\"\"))","v":""},null,null,"Dia",1]
[null,null,null,null,null,null,null,null,null,null,null,null,null,null,null,null,null,null,null,null,null,null,null,null,null,"Mês",{"$f":"IF((AA75+1)>12,1,AA75+1)","v":2}]
[null,null,null,null,null,null,null,null,null,null,null,null,null,null,null,null,null,null,null,null,null,null,null,null,null,"Ano",{"$f":"IF((AA75+1)>12,AA76+1,AA76)","v":2024}]
[null,null,null,null,null,null,null,null,null,null,null,null,null,null,null,null,null,null,null,null,null,null,null,null,null,"Primeiro dia",{"$f":"DATE(AA141,AA140,1)","v":"2024-02-01"}]
[null,null,null,null,null,null,null,null,null,null,null,null,null,null,null,null,null,null,null,null,null,null,null,null,null,"Dia da Semana",{"$f":"WEEKDAY(AA142)","v":5}]
[null,null,null,null,null,null,null,null,null,null,null,null,null,null,null,null,null,null,null,null,null,null,null,null,null,"Último dia",{"$f":"EOMONTH(AA142,0)","v":"2024-02-29"}]
[null,null,null,{"$f":"V138+1","v":4},null,null,{"$f":"D145+1","v":5},null,null,{"$f":"G145+1","v":6},null,null,{"$f":"J145+1","v":7},null,null,{"$f":"M145+1","v":8},null,null,{"$f":"P145+1","v":9},null,null,{"$f":"S145+1","v":10},null,null,null,"Dia",{"$f":"DAY(AA144)","v":29}]
[null,null,null,null,{"$f":"IF(D145=\"\",\"\",_xlfn._xlws.FILTER(Base!$B:$B,Base!$A:$A=DATE(Calendário!AA141,Calendário!AA140,Calendário!D145),\"\"))","v":""},null,null,{"$f":"IF(G145=\"\",\"\",_xlfn._xlws.FILTER(Base!$B:$B,Base!$A:$A=DATE(Calendário!AA141,Calendário!AA140,Calendário!G145),\"\"))","v":""},null,null,{"$f":"IF(J145=\"\",\"\",_xlfn._xlws.FILTER(Base!$B:$B,Base!$A:$A=DATE(Calendário!AA141,Calendário!AA140,Calendário!J145),\"\"))","v":""},null,null,{"$f":"IF(M145=\"\",\"\",_xlfn._xlws.FILTER(Base!$B:$B,Base!$A:$A=DATE(Calendário!AA141,Calendário!AA140,Calendário!M145),\"\"))","v":""},null,null,{"$f":"IF(P145=\"\",\"\",_xlfn._xlws.FILTER(Base!$B:$B,Base!$A:$A=DATE(Calendário!AA141,Calendário!AA140,Calendário!P145),\"\"))","v":""},null,null,{"$f":"IF(S145=\"\",\"\",_xlfn._xlws.FILTER(Base!$B:$B,Base!$A:$A=DATE(Calendário!AA141,Calendário!AA140,Calendário!S145),\"\"))","v":""},null,null,{"$f":"IF(V145=\"\",\"\",_xlfn._xlws.FILTER(Base!$B:$B,Base!$A:$A=DATE(Calendário!AA141,Calendário!AA140,Calendário!V145),\"\"))","v":""}]
[]
[]
[]
[]
[]
[null,null,null,{"$f":"V145+1","v":11},null,null,{"$f":"D152+1","v":12},null,null,{"$f":"G152+1","v":13},null,null,{"$f":"J152+1","v":14},null,null,{"$f":"M152+1","v":15},null,null,{"$f":"P152+1","v":16},null,null,{"$f":"S152+1","v":17}]
[null,null,null,null,{"$f":"IF(D152=\"\",\"\",_xlfn._xlws.FILTER(Base!$B:$B,Base!$A:$A=DATE(Calendário!AA141,Calendário!AA140,Calendário!D152),\"\"))","v":""},null,null,{"$f":"IF(G152=\"\",\"\",_xlfn._xlws.FILTER(Base!$B:$B,Base!$A:$A=DATE(Calendário!AA141,Calendário!AA140,Calendário!G152),\"\"))","v":""},null,null,{"$f":"IF(J152=\"\",\"\",_xlfn._xlws.FILTER(Base!$B:$B,Base!$A:$A=DATE(Calendário!AA141,Calendário!AA140,Calendário!J152),\"\"))","v":""},null,null,{"$f":"IF(M152=\"\",\"\",_xlfn._xlws.FILTER(Base!$B:$B,Base!$A:$A=DATE(Calendário!AA141,Calendário!AA140,Calendário!M152),\"\"))","v":""},null,null,{"$f":"IF(P152=\"\",\"\",_xlfn._xlws.FILTER(Base!$B:$B,Base!$A:$A=DATE(Calendário!AA141,Calendário!AA140,Calendário!P152),\"\"))","v":""},null,null,{"$f":"IF(S152=\"\",\"\",_xlfn._xlws.FILTER(Base!$B:$B,Base!$A:$A=DATE(Calendário!AA141,Calendário!AA140,Calendário!S152),\"\"))","v":""},null,null,{"$f":"IF(V152=\"\",\"\",_xlfn._xlws.FILTER(Base!$B:$B,Base!$A:$A=DATE(Calendário!AA141,Calendário!AA140,Calendário!V152),\"\"))","v":""}]
[]
[]
[]
[]
[]
[null,null,null,{"$f":"V152+1","v":18},null,null,{"$f":"D159+1","v":19},null,null,{"$f":"G159+1","v":20},null,null,{"$f":"J159+1","v":21},null,null,{"$f":"M159+1","v":22},null,null,{"$f":"P159+1","v":23},null,null,{"$f":"S159+1","v":24}]
[null,null,null,null,{"$f":"IF(D159=\"\",\"\",_xlfn._xlws.FILTER(Base!$B:$B,Base!$A:$A=DATE(Calendário!AA141,Calendário!AA140,Calendário!D159),\"\"))","v":""},null,null,{"$f":"IF(G159=\"\",\"\",_xlfn._xlws.FILTER(Base!$B:$B,Base!$A:$A=DATE(Calendário!AA141,Calendário!AA140,Calendário!G159),\"\"))","v":""},null,null,{"$f":"IF(J159=\"\",\"\",_xlfn._xlws.FILTER(Base!$B:$B,Base!$A:$A=DATE(Calendário!AA141,Calendário!AA140,Calendário!J159),\"\"))","v":""},null,null,{"$f":"IF(M159=\"\",\"\",_xlfn._xlws.FILTER(Base!$B:$B,Base!$A:$A=DATE(Calendário!AA141,Calendário!AA140,Calendário!M159),\"\"))","v":""},null,null,{"$f":"IF(P159=\"\",\"\",_xlfn._xlws.FILTER(Base!$B:$B,Base!$A:$A=DATE(Calendário!AA141,Calendário!AA140,Calendário!P159),\"\"))","v":""},null,null,{"$f":"IF(S159=\"\",\"\",_xlfn._xlws.FILTER(Base!$B:$B,Base!$A:$A=DATE(Calendário!AA141,Calendário!AA140,Calendário!S159),\"\"))","v":""},null,null,{"$f":"IF(V159=\"\",\"\",_xlfn._xlws.FILTER(Base!$B:$B,Base!$A:$A=DATE(Calendário!AA141,Calendário!AA140,Calendário!V159),\"\"))","v":""}]
[]
[]
[]
[]
[]
[null,null,null,{"$f":"IF(V159=\"\",\"\",IF(V159+1>AA145,\"\",V159+1))","v":25},null,null,{"$f":"IF(D166=\"\",\"\",IF(D166+1>AA145,\"\",D166+1))","v":26},null,null,{"$f":"IF(G166=\"\",\"\",IF(G166+1>AA145,\"\",G166+1))","v":27},null,null,{"$f":"IF(J166=\"\",\"\",IF(J166+1>AA145,\"\",J166+1))","v":28},null,null,{"$f":"IF(M166=\"\",\"\",IF(M166+1>AA145,\"\",M166+1))","v":29},null,null,{"$f":"IF(P166=\"\",\"\",IF(P166+1>AA145,\"\",P166+1))","v":""},null,null,{"$f":"IF(S166=\"\",\"\",IF(S166+1>AA145,\"\",S166+1))","v":""}]
[null,null,null,null,{"$f":"IF(D166=\"\",\"\",_xlfn._xlws.FILTER(Base!$B:$B,Base!$A:$A=DATE(Calendário!AA141,Calendário!AA140,Calendário!D166),\"\"))","v":""},null,null,{"$f":"IF(G166=\"\",\"\",_xlfn._xlws.FILTER(Base!$B:$B,Base!$A:$A=DATE(Calendário!AA141,Calendário!AA140,Calendário!G166),\"\"))","v":""},null,null,{"$f":"IF(J166=\"\",\"\",_xlfn._xlws.FILTER(Base!$B:$B,Base!$A:$A=DATE(Calendário!AA141,Calendário!AA140,Calendário!J166),\"\"))","v":""},null,null,{"$f":"IF(M166=\"\",\"\",_xlfn._xlws.FILTER(Base!$B:$B,Base!$A:$A=DATE(Calendário!AA141,Calendário!AA140,Calendário!M166),\"\"))","v":""},null,null,{"$f":"IF(P166=\"\",\"\",_xlfn._xlws.FILTER(Base!$B:$B,Base!$A:$A=DATE(Calendário!AA141,Calendário!AA140,Calendário!P166),\"\"))","v":""},null,null,{"$f":"IF(S166=\"\",\"\",_xlfn._xlws.FILTER(Base!$B:$B,Base!$A:$A=DATE(Calendário!AA141,Calendário!AA140,Calendário!S166),\"\"))","v":""},null,null,{"$f":"IF(V166=\"\",\"\",_xlfn._xlws.FILTER(Base!$B:$B,Base!$A:$A=DATE(Calendário!AA141,Calendário!AA140,Calendário!V166),\"\"))","v":""}]
[]
[]
[]
[]
[]
[null,null,null,{"$f":"IF(V166=\"\",\"\",IF(V166+1>AA145,\"\",V166+1))","v":""},null,null,{"$f":"IF(D173=\"\",\"\",IF(D173+1>AA145,\"\",D173+1))","v":""},null,null,{"$f":"IF(G173=\"\",\"\",IF(G173+1>AA145,\"\",G173+1))","v":""},null,null,{"$f":"IF(J173=\"\",\"\",IF(J173+1>AA145,\"\",J173+1))","v":""},null,null,{"$f":"IF(M173=\"\",\"\",IF(M173+1>AA145,\"\",M173+1))","v":""},null,null,{"$f":"IF(P173=\"\",\"\",IF(P173+1>AA145,\"\",P173+1))","v":""},null,null,{"$f":"IF(S173=\"\",\"\",IF(S173+1>AA145,\"\",S173+1))","v":""}]
[null,null,null,null,{"$f":"IF(D173=\"\",\"\",_xlfn._xlws.FILTER(Base!$B:$B,Base!$A:$A=DATE(Calendário!AA141,Calendário!AA140,Calendário!D173),\"\"))","v":""},null,null,{"$f":"IF(G173=\"\",\"\",_xlfn._xlws.FILTER(Base!$B:$B,Base!$A:$A=DATE(Calendário!AA141,Calendário!AA140,Calendário!G173),\"\"))","v":""},null,null,{"$f":"IF(J173=\"\",\"\",_xlfn._xlws.FILTER(Base!$B:$B,Base!$A:$A=DATE(Calendário!AA141,Calendário!AA140,Calendário!J173),\"\"))","v":""},null,null,{"$f":"IF(M173=\"\",\"\",_xlfn._xlws.FILTER(Base!$B:$B,Base!$A:$A=DATE(Calendário!AA141,Calendário!AA140,Calendário!M173),\"\"))","v":""},null,null,{"$f":"IF(P173=\"\",\"\",_xlfn._xlws.FILTER(Base!$B:$B,Base!$A:$A=DATE(Calendário!AA141,Calendário!AA140,Calendário!P173),\"\"))","v":""},null,null,{"$f":"IF(S173=\"\",\"\",_xlfn._xlws.FILTER(Base!$B:$B,Base!$A:$A=DATE(Calendário!AA141,Calendário!AA140,Calendário!S173),\"\"))","v":""},null,null,{"$f":"IF(V173=\"\",\"\",_xlfn._xlws.FILTER(Base!$B:$B,Base!$A:$A=DATE(Calendário!AA141,Calendário!AA140,Calendário!V173),\"\"))","v":""}]
[]
[]
[]
[]
[]
[]
[]
[null,null,null,"Anotações"]
[]
[]
[]
[]
[]
[]
[]
[]
[]
[]
[]
[]
[]
[]
[]
[]
[]
[null,null,null,{"$f":"_xlfn.XLOOKUP(AA205,Base!$T$5:$T$16,Base!$U$5:$U$16,\"\",0,1)&\"|\"&AA206","v":"MARÇO|2024"}]
[null,null,null,1,null,null,2,null,null,3,null,null,4,null,null,5,null,null,6,null,null,7]
[null,null,null,"Domingo",null,null,"Segunda-feira",null,null,"Terça-feira",null,null,"Quarta-feira",null,null,"Quinta-feira",null,null,"Sexta-feira",null,null,"Sábado"]
[null,null,null,{"$f":"IF(D201=AA208,1,IF(C204=\"\",\"\",C204+1))","v":""},null,null,{"$f":"IF(G201=AA208,1,IF(D203=\"\",\"\",D203+1))","v":""},null,null,{"$f":"IF(J201=AA208,1,IF(G203=\"\",\"\",G203+1))","v":""},null,null,{"$f":"IF(M201=AA208,1,IF(J203=\"\",\"\",J203+1))","v":""},null,null,{"$f":"IF(P201=AA208,1,IF(M203=\"\",\"\",M203+1))","v":""},null,null,{"$f":"IF(S201=AA208,1,IF(P203=\"\",\"\",P203+1))","v":1},null,null,{"$f":"IF(V201=AA208,1,IF(S203=\"\",\"\",S203+1))","v":2}]
[null,null,null,null,{"$f":"IF(D203=\"\",\"\",_xlfn._xlws.FILTER(Base!$B:$B,Base!$A:$A=DATE(Calendário!AA206,Calendário!AA205,Calendário!D203),\"\"))","v":""},null,null,{"$f":"IF(G203=\"\",\"\",_xlfn._xlws.FILTER(Base!$B:$B,Base!$A:$A=DATE(Calendário!AA206,Calendário!AA205,Calendário!G203),\"\"))","v":""},null,null,{"$f":"IF(J203=\"\",\"\",_xlfn._xlws.FILTER(Base!$B:$B,Base!$A:$A=DATE(Calendário!AA206,Calendário!AA205,Calendário!J203),\"\"))","v":""},null,null,{"$f":"IF(M203=\"\",\"\",_xlfn._xlws.FILTER(Base!$B:$B,Base!$A:$A=DATE(Calendário!AA206,Calendário!AA205,Calendário!M203),\"\"))","v":""},null,null,{"$f":"IF(P203=\"\",\"\",_xlfn._xlws.FILTER(Base!$B:$B,Base!$A:$A=DATE(Calendário!AA206,Calendário!AA205,Calendário!P203),\"\"))","v":""},null,null,{"$f":"IF(S203=\"\",\"\",_xlfn._xlws.FILTER(Base!$B:$B,Base!$A:$A=DATE(Calendário!AA206,Calendário!AA205,Calendário!S203),\"\"))","v":""},null,null,{"$f":"IF(V203=\"\",\"\",_xlfn._xlws.FILTER(Base!$B:$B,Base!$A:$A=DATE(Calendário!AA206,Calendário!AA205,Calendário!V203),\"\"))","v":""},null,null,"Dia",1]
[null,null,null,null,null,null,null,null,null,null,null,null,null,null,null,null,null,null,null,null,null,null,null,null,null,"Mês",{"$f":"IF((AA140+1)>12,1,AA140+1)","v":3}]
[null,null,null,null,null,null,null,null,null,null,null,null,null,null,null,null,null,null,null,null,null,null,null,null,null,"Ano",{"$f":"IF((AA140+1)>12,AA141+1,AA141)","v":2024}]
[null,null,null,null,null,null,null,null,null,null,null,null,null,null,null,null,null,null,null,null,null,null,null,null,null,"Primeiro dia",{"$f":"DATE(AA206,AA205,1)","v":"2024-03-01"}]
[null,null,null,null,null,null,null,null,null,null,null,null,null,null,null,null,null,null,null,null,null,null,null,null,null,"Dia da Semana",{"$f":"WEEKDAY(AA207)","v":6}]
[null,null,null,null,null,null,null,null,null,null,null,null,null,null,null,null,null,null,null,null,null,null,null,null,null,"Último dia",{"$f":"EOMONTH(AA207,0)","v":"2024-03-31"}]
[null,null,null,{"$f":"V203+1","v":3},null,null,{"$f":"D210+1","v":4},null,null,{"$f":"G210+1","v":5},null,null,{"$f":"J210+1","v":6},null,null,{"$f":"M210+1","v":7},null,null,{"$f":"P210+1","v":8},null,null,{"$f":"S210+1","v":9},null,null,null,"Dia",{"$f":"DAY(AA209)","v":31}]
[null,null,null,null,{"$f":"IF(D210=\"\",\"\",_xlfn._xlws.FILTER(Base!$B:$B,Base!$A:$A=DATE(Calendário!AA206,Calendário!AA205,Calendário!D210),\"\"))","v":""},null,null,{"$f":"IF(G210=\"\",\"\",_xlfn._xlws.FILTER(Base!$B:$B,Base!$A:$A=DATE(Calendário!AA206,Calendário!AA205,Calendário!G210),\"\"))","v":""},null,null,{"$f":"IF(J210=\"\",\"\",_xlfn._xlws.FILTER(Base!$B:$B,Base!$A:$A=DATE(Calendário!AA206,Calendário!AA205,Calendário!J210),\"\"))","v":""},null,null,{"$f":"IF(M210=\"\",\"\",_xlfn._xlws.FILTER(Base!$B:$B,Base!$A:$A=DATE(Calendário!AA206,Calendário!AA205,Calendário!M210),\"\"))","v":""},null,null,{"$f":"IF(P210=\"\",\"\",_xlfn._xlws.FILTER(Base!$B:$B,Base!$A:$A=DATE(Calendário!AA206,Calendário!AA205,Calendário!P210),\"\"))","v":""},null,null,{"$f":"IF(S210=\"\",\"\",_xlfn._xlws.FILTER(Base!$B:$B,Base!$A:$A=DATE(Calendário!AA206,Calendário!AA205,Calendário!S210),\"\"))","v":""},null,null,{"$f":"IF(V210=\"\",\"\",_xlfn._xlws.FILTER(Base!$B:$B,Base!$A:$A=DATE(Calendário!AA206,Calendário!AA205,Calendário!V210),\"\"))","v":""}]
[]
[]
[]
[]
[]
[null,null,null,{"$f":"V210+1","v":10},null,null,{"$f":"D217+1","v":11},null,null,{"$f":"G217+1","v":12},null,null,{"$f":"J217+1","v":13},null,null,{"$f":"M217+1","v":14},null,null,{"$f":"P217+1","v":15},null,null,{"$f":"S217+1","v":16}]
[null,null,null,null,{"$f":"IF(D217=\"\",\"\",_xlfn._xlws.FILTER(Base!$B:$B,Base!$A:$A=DATE(Calendário!AA206,Calendário!AA205,Calendário!D217),\"\"))","v":""},null,null,{"$f":"IF(G217=\"\",\"\",_xlfn._xlws.FILTER(Base!$B:$B,Base!$A:$A=DATE(Calendário!AA206,Calendário!AA205,Calendário!G217),\"\"))","v":""},null,null,{"$f":"IF(J217=\"\",\"\",_xlfn._xlws.FILTER(Base!$B:$B,Base!$A:$A=DATE(Calendário!AA206,Calendário!AA205,Calendário!J217),\"\"))","v":""},null,null,{"$f":"IF(M217=\"\",\"\",_xlfn._xlws.FILTER(Base!$B:$B,Base!$A:$A=DATE(Calendário!AA206,Calendário!AA205,Calendário!M217),\"\"))","v":""},null,null,{"$f":"IF(P217=\"\",\"\",_xlfn._xlws.FILTER(Base!$B:$B,Base!$A:$A=DATE(Calendário!AA206,Calendário!AA205,Calendário!P217),\"\"))","v":""},null,null,{"$f":"IF(S217=\"\",\"\",_xlfn._xlws.FILTER(Base!$B:$B,Base!$A:$A=DATE(Calendário!AA206,Calendário!AA205,Calendário!S217),\"\"))","v":""},null,null,{"$f":"IF(V217=\"\",\"\",_xlfn._xlws.FILTER(Base!$B:$B,Base!$A:$A=DATE(Calendário!AA206,Calendário!AA205,Calendário!V217),\"\"))","v":""}]
[]
[]
[]
[]
[]
[null,null,null,{"$f":"V217+1","v":17},null,null,{"$f":"D224+1","v":18},null,null,{"$f":"G224+1","v":19},null,null,{"$f":"J224+1","v":20},null,null,{"$f":"M224+1","v":21},null,null,{"$f":"P224+1","v":22},null,null,{"$f":"S224+1","v":23}]
[null,null,null,null,{"$f":"IF(D224=\"\",\"\",_xlfn._xlws.FILTER(Base!$B:$B,Base!$A:$A=DATE(Calendário!AA206,Calendário!AA205,Calendário!D224),\"\"))","v":""},null,null,{"$f":"IF(G224=\"\",\"\",_xlfn._xlws.FILTER(Base!$B:$B,Base!$A:$A=DATE(Calendário!AA206,Calendário!AA205,Calendário!G224),\"\"))","v":""},null,null,{"$f":"IF(J224=\"\",\"\",_xlfn._xlws.FILTER(Base!$B:$B,Base!$A:$A=DATE(Calendário!AA206,Calendário!AA205,Calendário!J224),\"\"))","v":""},null,null,{"$f":"IF(M224=\"\",\"\",_xlfn._xlws.FILTER(Base!$B:$B,Base!$A:$A=DATE(Calendário!AA206,Calendário!AA205,Calendário!M224),\"\"))","v":""},null,null,{"$f":"IF(P224=\"\",\"\",_xlfn._xlws.FILTER(Base!$B:$B,Base!$A:$A=DATE(Calendário!AA206,Calendário!AA205,Calendário!P224),\"\"))","v":""},null,null,{"$f":"IF(S224=\"\",\"\",_xlfn._xlws.FILTER(Base!$B:$B,Base!$A:$A=DATE(Calendário!AA206,Calendário!AA205,Calendário!S224),\"\"))","v":""},null,null,{"$f":"IF(V224=\"\",\"\",_xlfn._xlws.FILTER(Base!$B:$B,Base!$A:$A=DATE(Calendário!AA206,Calendário!AA205,Calendário!V224),\"\"))","v":""}]
[]
[]
[]
[]
[]
[null,null,null,{"$f":"IF(V224=\"\",\"\",IF(V224+1>AA210,\"\",V224+1))","v":24},null,null,{"$f":"IF(D231=\"\",\"\",IF(D231+1>AA210,\"\",D231+1))","v":25},null,null,{"$f":"IF(G231=\"\",\"\",IF(G231+1>AA210,\"\",G231+1))","v":26},null,null,{"$f":"IF(J231=\"\",\"\",IF(J231+1>AA210,\"\",J231+1))","v":27},null,null,{"$f":"IF(M231=\"\",\"\",IF(M231+1>AA210,\"\",M231+1))","v":28},null,null,{"$f":"IF(P231=\"\",\"\",IF(P231+1>AA210,\"\",P231+1))","v":29},null,null,{"$f":"IF(S231=\"\",\"\",IF(S231+1>AA210,\"\",S231+1))","v":30}]
[null,null,null,null,{"$f":"IF(D231=\"\",\"\",_xlfn._xlws.FILTER(Base!$B:$B,Base!$A:$A=DATE(Calendário!AA206,Calendário!AA205,Calendário!D231),\"\"))","v":""},null,null,{"$f":"IF(G231=\"\",\"\",_xlfn._xlws.FILTER(Base!$B:$B,Base!$A:$A=DATE(Calendário!AA206,Calendário!AA205,Calendário!G231),\"\"))","v":""},null,null,{"$f":"IF(J231=\"\",\"\",_xlfn._xlws.FILTER(Base!$B:$B,Base!$A:$A=DATE(Calendário!AA206,Calendário!AA205,Calendário!J231),\"\"))","v":""},null,null,{"$f":"IF(M231=\"\",\"\",_xlfn._xlws.FILTER(Base!$B:$B,Base!$A:$A=DATE(Calendário!AA206,Calendário!AA205,Calendário!M231),\"\"))","v":""},null,null,{"$f":"IF(P231=\"\",\"\",_xlfn._xlws.FILTER(Base!$B:$B,Base!$A:$A=DATE(Calendário!AA206,Calendário!AA205,Calendário!P231),\"\"))","v":""},null,null,{"$f":"IF(S231=\"\",\"\",_xlfn._xlws.FILTER(Base!$B:$B,Base!$A:$A=DATE(Calendário!AA206,Calendário!AA205,Calendário!S231),\"\"))","v":""},null,null,{"$f":"IF(V231=\"\",\"\",_xlfn._xlws.FILTER(Base!$B:$B,Base!$A:$A=DATE(Calendário!AA206,Calendário!AA205,Calendário!V231),\"\"))","v":""}]
[]
[]
[]
[]
[]
[null,null,null,{"$f":"IF(V231=\"\",\"\",IF(V231+1>AA210,\"\",V231+1))","v":31},null,null,{"$f":"IF(D238=\"\",\"\",IF(D238+1>AA210,\"\",D238+1))","v":""},null,null,{"$f":"IF(G238=\"\",\"\",IF(G238+1>AA210,\"\",G238+1))","v":""},null,null,{"$f":"IF(J238=\"\",\"\",IF(J238+1>AA210,\"\",J238+1))","v":""},null,null,{"$f":"IF(M238=\"\",\"\",IF(M238+1>AA210,\"\",M238+1))","v":""},null,null,{"$f":"IF(P238=\"\",\"\",IF(P238+1>AA210,\"\",P238+1))","v":""},null,null,{"$f":"IF(S238=\"\",\"\",IF(S238+1>AA210,\"\",S238+1))","v":""}]
[null,null,null,null,{"$f":"IF(D238=\"\",\"\",_xlfn._xlws.FILTER(Base!$B:$B,Base!$A:$A=DATE(Calendário!AA206,Calendário!AA205,Calendário!D238),\"\"))","v":""},null,null,{"$f":"IF(G238=\"\",\"\",_xlfn._xlws.FILTER(Base!$B:$B,Base!$A:$A=DATE(Calendário!AA206,Calendário!AA205,Calendário!G238),\"\"))","v":""},null,null,{"$f":"IF(J238=\"\",\"\",_xlfn._xlws.FILTER(Base!$B:$B,Base!$A:$A=DATE(Calendário!AA206,Calendário!AA205,Calendário!J238),\"\"))","v":""},null,null,{"$f":"IF(M238=\"\",\"\",_xlfn._xlws.FILTER(Base!$B:$B,Base!$A:$A=DATE(Calendário!AA206,Calendário!AA205,Calendário!M238),\"\"))","v":""},null,null,{"$f":"IF(P238=\"\",\"\",_xlfn._xlws.FILTER(Base!$B:$B,Base!$A:$A=DATE(Calendário!AA206,Calendário!AA205,Calendário!P238),\"\"))","v":""},null,null,{"$f":"IF(S238=\"\",\"\",_xlfn._xlws.FILTER(Base!$B:$B,Base!$A:$A=DATE(Calendário!AA206,Calendário!AA205,Calendário!S238),\"\"))","v":""},null,null,{"$f":"IF(V238=\"\",\"\",_xlfn._xlws.FILTER(Base!$B:$B,Base!$A:$A=DATE(Calendário!AA206,Calendário!AA205,Calendário!V238),\"\"))","v":""}]
[]
[]
[]
[]
[]
[]
[]
[null,null,null,"Anotações"]
[]
[]
[]
[]
[]
[]
[]
[]
[]
[]
[]
[]
[]
[]
[]
[]
[]
[null,null,null,{"$f":"_xlfn.XLOOKUP(AA270,Base!$T$5:$T$16,Base!$U$5:$U$16,\"\",0,1)&\"|\"&AA271","v":"ABRIL|2024"}]
[null,null,null,1,null,null,2,null,null,3,null,null,4,null,null,5,null,null,6,null,null,7]
[null,null,null,"Domingo",null,null,"Segunda-feira",null,null,"Terça-feira",null,null,"Quarta-feira",null,null,"Quinta-feira",null,null,"Sexta-feira",null,null,"Sábado"]
[null,null,null,{"$f":"IF(D266=AA273,1,IF(C269=\"\",\"\",C269+1))","v":""},null,null,{"$f":"IF(G266=AA273,1,IF(D268=\"\",\"\",D268+1))","v":1},null,null,{"$f":"IF(J266=AA273,1,IF(G268=\"\",\"\",G268+1))","v":2},null,null,{"$f":"IF(M266=AA273,1,IF(J268=\"\",\"\",J268+1))","v":3},null,null,{"$f":"IF(P266=AA273,1,IF(M268=\"\",\"\",M268+1))","v":4},null,null,{"$f":"IF(S266=AA273,1,IF(P268=\"\",\"\",P268+1))","v":5},null,null,{"$f":"IF(V266=AA273,1,IF(S268=\"\",\"\",S268+1))","v":6}]
[null,null,null,null,{"$f":"IF(D268=\"\",\"\",_xlfn._xlws.FILTER(Base!$B:$B,Base!$A:$A=DATE(Calendário!AA271,Calendário!AA270,Calendário!D268),\"\"))","v":""},null,null,{"$f":"IF(G268=\"\",\"\",_xlfn._xlws.FILTER(Base!$B:$B,Base!$A:$A=DATE(Calendário!AA271,Calendário!AA270,Calendário!G268),\"\"))","v":""},null,null,{"$f":"IF(J268=\"\",\"\",_xlfn._xlws.FILTER(Base!$B:$B,Base!$A:$A=DATE(Calendário!AA271,Calendário!AA270,Calendário!J268),\"\"))","v":""},null,null,{"$f":"IF(M268=\"\",\"\",_xlfn._xlws.FILTER(Base!$B:$B,Base!$A:$A=DATE(Calendário!AA271,Calendário!AA270,Calendário!M268),\"\"))","v":""},null,null,{"$f":"IF(P268=\"\",\"\",_xlfn._xlws.FILTER(Base!$B:$B,Base!$A:$A=DATE(Calendário!AA271,Calendário!AA270,Calendário!P268),\"\"))","v":""},null,null,{"$f":"IF(S268=\"\",\"\",_xlfn._xlws.FILTER(Base!$B:$B,Base!$A:$A=DATE(Calendário!AA271,Calendário!AA270,Calendário!S268),\"\"))","v":""},null,null,{"$f":"IF(V268=\"\",\"\",_xlfn._xlws.FILTER(Base!$B:$B,Base!$A:$A=DATE(Calendário!AA271,Calendário!AA270,Calendário!V268),\"\"))","v":""},null,null,"Dia",1]
[null,null,null,null,null,null,null,null,null,null,null,null,null,null,null,null,null,null,null,null,null,null,null,null,null,"Mês",{"$f":"IF((AA205+1)>12,1,AA205+1)","v":4}]
[null,null,null,null,null,null,null,null,null,null,null,null,null,null,null,null,null,null,null,null,null,null,null,null,null,"Ano",{"$f":"IF((AA205+1)>12,AA206+1,AA206)","v":2024}]
[null,null,null,null,null,null,null,null,null,null,null,null,null,null,null,null,null,null,null,null,null,null,null,null,null,"Primeiro dia",{"$f":"DATE(AA271,AA270,1)","v":"2024-04-01"}]
[null,null,null,null,null,null,null,null,null,null,null,null,null,null,null,null,null,null,null,null,null,null,null,null,null,"Dia da Semana",{"$f":"WEEKDAY(AA272)","v":2}]
[null,null,null,null,null,null,null,null,null,null,null,null,null,null,null,null,null,null,null,null,null,null,null,null,null,"Último dia",{"$f":"EOMONTH(AA272,0)","v":"2024-04-30"}]
[null,null,null,{"$f":"V268+1","v":7},null,null,{"$f":"D275+1","v":8},null,null,{"$f":"G275+1","v":9},null,null,{"$f":"J275+1","v":10},null,null,{"$f":"M275+1","v":11},null,null,{"$f":"P275+1","v":12},null,null,{"$f":"S275+1","v":13},null,null,null,"Dia",{"$f":"DAY(AA274)","v":30}]
[null,null,null,null,{"$f":"IF(D275=\"\",\"\",_xlfn._xlws.FILTER(Base!$B:$B,Base!$A:$A=DATE(Calendário!AA271,Calendário!AA270,Calendário!D275),\"\"))","v":""},null,null,{"$f":"IF(G275=\"\",\"\",_xlfn._xlws.FILTER(Base!$B:$B,Base!$A:$A=DATE(Calendário!AA271,Calendário!AA270,Calendário!G275),\"\"))","v":""},null,null,{"$f":"IF(J275=\"\",\"\",_xlfn._xlws.FILTER(Base!$B:$B,Base!$A:$A=DATE(Calendário!AA271,Calendário!AA270,Calendário!J275),\"\"))","v":""},null,null,{"$f":"IF(M275=\"\",\"\",_xlfn._xlws.FILTER(Base!$B:$B,Base!$A:$A=DATE(Calendário!AA271,Calendário!AA270,Calendário!M275),\"\"))","v":""},null,null,{"$f":"IF(P275=\"\",\"\",_xlfn._xlws.FILTER(Base!$B:$B,Base!$A:$A=DATE(Calendário!AA271,Calendário!AA270,Calendário!P275),\"\"))","v":""},null,null,{"$f":"IF(S275=\"\",\"\",_xlfn._xlws.FILTER(Base!$B:$B,Base!$A:$A=DATE(Calendário!AA271,Calendário!AA270,Calendário!S275),\"\"))","v":""},null,null,{"$f":"IF(V275=\"\",\"\",_xlfn._xlws.FILTER(Base!$B:$B,Base!$A:$A=DATE(Calendário!AA271,Calendário!AA270,Calendário!V275),\"\"))","v":""}]
[]
[]
[]
[]
[]
[null,null,null,{"$f":"V275+1","v":14},null,null,{"$f":"D282+1","v":15},null,null,{"$f":"G282+1","v":16},null,null,{"$f":"J282+1","v":17},null,null,{"$f":"M282+1","v":18},null,null,{"$f":"P282+1","v":19},null,null,{"$f":"S282+1","v":20}]
[null,null,null,null,{"$f":"IF(D282=\"\",\"\",_xlfn._xlws.FILTER(Base!$B:$B,Base!$A:$A=DATE(Calendário!AA271,Calendário!AA270,Calendário!D282),\"\"))","v":""},null,null,{"$f":"IF(G282=\"\",\"\",_xlfn._xlws.FILTER(Base!$B:$B,Base!$A:$A=DATE(Calendário!AA271,Calendário!AA270,Calendário!G282),\"\"))","v":""},null,null,{"$f":"IF(J282=\"\",\"\",_xlfn._xlws.FILTER(Base!$B:$B,Base!$A:$A=DATE(Calendário!AA271,Calendário!AA270,Calendário!J282),\"\"))","v":""},null,null,{"$f":"IF(M282=\"\",\"\",_xlfn._xlws.FILTER(Base!$B:$B,Base!$A:$A=DATE(Calendário!AA271,Calendário!AA270,Calendário!M282),\"\"))","v":""},null,null,{"$f":"IF(P282=\"\",\"\",_xlfn._xlws.FILTER(Base!$B:$B,Base!$A:$A=DATE(Calendário!AA271,Calendário!AA270,Calendário!P282),\"\"))","v":""},null,null,{"$f":"IF(S282=\"\",\"\",_xlfn._xlws.FILTER(Base!$B:$B,Base!$A:$A=DATE(Calendário!AA271,Calendário!AA270,Calendário!S282),\"\"))","v":""},null,null,{"$f":"IF(V282=\"\",\"\",_xlfn._xlws.FILTER(Base!$B:$B,Base!$A:$A=DATE(Calendário!AA271,Calendário!AA270,Calendário!V282),\"\"))","v":""}]
[]
[]
[]
[]
[]
[null,null,null,{"$f":"V282+1","v":21},null,null,{"$f":"D289+1","v":22},null,null,{"$f":"G289+1","v":23},null,null,{"$f":"J289+1","v":24},null,null,{"$f":"M289+1","v":25},null,null,{"$f":"P289+1","v":26},null,null,{"$f":"S289+1","v":27}]
[null,null,null,null,{"$f":"IF(D289=\"\",\"\",_xlfn._xlws.FILTER(Base!$B:$B,Base!$A:$A=DATE(Calendário!AA271,Calendário!AA270,Calendário!D289),\"\"))","v":""},null,null,{"$f":"IF(G289=\"\",\"\",_xlfn._xlws.FILTER(Base!$B:$B,Base!$A:$A=DATE(Calendário!AA271,Calendário!AA270,Calendário!G289),\"\"))","v":""},null,null,{"$f":"IF(J289=\"\",\"\",_xlfn._xlws.FILTER(Base!$B:$B,Base!$A:$A=DATE(Calendário!AA271,Calendário!AA270,Calendário!J289),\"\"))","v":""},null,null,{"$f":"IF(M289=\"\",\"\",_xlfn._xlws.FILTER(Base!$B:$B,Base!$A:$A=DATE(Calendário!AA271,Calendário!AA270,Calendário!M289),\"\"))","v":""},null,null,{"$f":"IF(P289=\"\",\"\",_xlfn._xlws.FILTER(Base!$B:$B,Base!$A:$A=DATE(Calendário!AA271,Calendário!AA270,Calendário!P289),\"\"))","v":""},null,null,{"$f":"IF(S289=\"\",\"\",_xlfn._xlws.FILTER(Base!$B:$B,Base!$A:$A=DATE(Calendário!AA271,Calendário!AA270,Calendário!S289),\"\"))","v":""},null,null,{"$f":"IF(V289=\"\",\"\",_xlfn._xlws.FILTER(Base!$B:$B,Base!$A:$A=DATE(Calendário!AA271,Calendário!AA270,Calendário!V289),\"\"))","v":""}]
[]
[]
[]
[]
[]
[null,null,null,{"$f":"IF(V289=\"\",\"\",IF(V289+1>AA275,\"\",V289+1))","v":28},null,null,{"$f":"IF(D296=\"\",\"\",IF(D296+1>AA275,\"\",D296+1))","v":29},null,null,{"$f":"IF(G296=\"\",\"\",IF(G296+1>AA275,\"\",G296+1))","v":30},null,null,{"$f":"IF(J296=\"\",\"\",IF(J296+1>AA275,\"\",J296+1))","v":""},null,null,{"$f":"IF(M296=\"\",\"\",IF(M296+1>AA275,\"\",M296+1))","v":""},null,null,{"$f":"IF(P296=\"\",\"\",IF(P296+1>AA275,\"\",P296+1))","v":""},null,null,{"$f":"IF(S296=\"\",\"\",IF(S296+1>AA275,\"\",S296+1))","v":""}]
[null,null,null,null,{"$f":"IF(D296=\"\",\"\",_xlfn._xlws.FILTER(Base!$B:$B,Base!$A:$A=DATE(Calendário!AA271,Calendário!AA270,Calendário!D296),\"\"))","v":""},null,null,{"$f":"IF(G296=\"\",\"\",_xlfn._xlws.FILTER(Base!$B:$B,Base!$A:$A=DATE(Calendário!AA271,Calendário!AA270,Calendário!G296),\"\"))","v":""},null,null,{"$f":"IF(J296=\"\",\"\",_xlfn._xlws.FILTER(Base!$B:$B,Base!$A:$A=DATE(Calendário!AA271,Calendário!AA270,Calendário!J296),\"\"))","v":""},null,null,{"$f":"IF(M296=\"\",\"\",_xlfn._xlws.FILTER(Base!$B:$B,Base!$A:$A=DATE(Calendário!AA271,Calendário!AA270,Calendário!M296),\"\"))","v":""},null,null,{"$f":"IF(P296=\"\",\"\",_xlfn._xlws.FILTER(Base!$B:$B,Base!$A:$A=DATE(Calendário!AA271,Calendário!AA270,Calendário!P296),\"\"))","v":""},null,null,{"$f":"IF(S296=\"\",\"\",_xlfn._xlws.FILTER(Base!$B:$B,Base!$A:$A=DATE(Calendário!AA271,Calendário!AA270,Calendário!S296),\"\"))","v":""},null,null,{"$f":"IF(V296=\"\",\"\",_xlfn._xlws.FILTER(Base!$B:$B,Base!$A:$A=DATE(Calendário!AA271,Calendário!AA270,Calendário!V296),\"\"))","v":""}]
[]
[]
[]
[]
[]
[null,null,null,{"$f":"IF(V296=\"\",\"\",IF(V296+1>AA275,\"\",V296+1))","v":""},null,null,{"$f":"IF(D303=\"\",\"\",IF(D303+1>AA275,\"\",D303+1))","v":""},null,null,{"$f":"IF(G303=\"\",\"\",IF(G303+1>AA275,\"\",G303+1))","v":""},null,null,{"$f":"IF(J303=\"\",\"\",IF(J303+1>AA275,\"\",J303+1))","v":""},null,null,{"$f":"IF(M303=\"\",\"\",IF(M303+1>AA275,\"\",M303+1))","v":""},null,null,{"$f":"IF(P303=\"\",\"\",IF(P303+1>AA275,\"\",P303+1))","v":""},null,null,{"$f":"IF(S303=\"\",\"\",IF(S303+1>AA275,\"\",S303+1))","v":""}]
[null,null,null,null,{"$f":"IF(D303=\"\",\"\",_xlfn._xlws.FILTER(Base!$B:$B,Base!$A:$A=DATE(Calendário!AA271,Calendário!AA270,Calendário!D303),\"\"))","v":""},null,null,{"$f":"IF(G303=\"\",\"\",_xlfn._xlws.FILTER(Base!$B:$B,Base!$A:$A=DATE(Calendário!AA271,Calendário!AA270,Calendário!G303),\"\"))","v":""},null,null,{"$f":"IF(J303=\"\",\"\",_xlfn._xlws.FILTER(Base!$B:$B,Base!$A:$A=DATE(Calendário!AA271,Calendário!AA270,Calendário!J303),\"\"))","v":""},null,null,{"$f":"IF(M303=\"\",\"\",_xlfn._xlws.FILTER(Base!$B:$B,Base!$A:$A=DATE(Calendário!AA271,Calendário!AA270,Calendário!M303),\"\"))","v":""},null,null,{"$f":"IF(P303=\"\",\"\",_xlfn._xlws.FILTER(Base!$B:$B,Base!$A:$A=DATE(Calendário!AA271,Calendário!AA270,Calendário!P303),\"\"))","v":""},null,null,{"$f":"IF(S303=\"\",\"\",_xlfn._xlws.FILTER(Base!$B:$B,Base!$A:$A=DATE(Calendário!AA271,Calendário!AA270,Calendário!S303),\"\"))","v":""},null,null,{"$f":"IF(V303=\"\",\"\",_xlfn._xlws.FILTER(Base!$B:$B,Base!$A:$A=DATE(Calendário!AA271,Calendário!AA270,Calendário!V303),\"\"))","v":""}]
[]
[]
[]
[]
[]
[]
[]
[null,null,null,"Anotações"]
[]
[]
[]
[]
[]
[]
[]
[]
[]
[]
[]
[]
[]
[]
[]
[]
[]
[null,null,null,{"$f":"_xlfn.XLOOKUP(AA335,Base!$T$5:$T$16,Base!$U$5:$U$16,\"\",0,1)&\"|\"&AA336","v":"MAIO|2024"}]
[null,null,null,1,null,null,2,null,null,3,null,null,4,null,null,5,null,null,6,null,null,7]
[null,null,null,"Domingo",null,null,"Segunda-feira",null,null,"Terça-feira",null,null,"Quarta-feira",null,null,"Quinta-feira",null,null,"Sexta-feira",null,null,"Sábado"]
[null,null,null,{"$f":"IF(D331=AA338,1,IF(C334=\"\",\"\",C334+1))","v":""},null,null,{"$f":"IF(G331=AA338,1,IF(D333=\"\",\"\",D333+1))","v":""},null,null,{"$f":"IF(J331=AA338,1,IF(G333=\"\",\"\",G333+1))","v":""},null,null,{"$f":"IF(M331=AA338,1,IF(J333=\"\",\"\",J333+1))","v":1},null,null,{"$f":"IF(P331=AA338,1,IF(M333=\"\",\"\",M333+1))","v":2},null,null,{"$f":"IF(S331=AA338,1,IF(P333=\"\",\"\",P333+1))","v":3},null,null,{"$f":"IF(V331=AA338,1,IF(S333=\"\",\"\",S333+1))","v":4}]
[null,null,null,null,{"$f":"IF(D333=\"\",\"\",_xlfn._xlws.FILTER(Base!$B:$B,Base!$A:$A=DATE(Calendário!AA336,Calendário!AA335,Calendário!D333),\"\"))","v":""},null,null,{"$f":"IF(G333=\"\",\"\",_xlfn._xlws.FILTER(Base!$B:$B,Base!$A:$A=DATE(Calendário!AA336,Calendário!AA335,Calendário!G333),\"\"))","v":""},null,null,{"$f":"IF(J333=\"\",\"\",_xlfn._xlws.FILTER(Base!$B:$B,Base!$A:$A=DATE(Calendário!AA336,Calendário!AA335,Calendário!J333),\"\"))","v":""},null,null,{"$f":"IF(M333=\"\",\"\",_xlfn._xlws.FILTER(Base!$B:$B,Base!$A:$A=DATE(Calendário!AA336,Calendário!AA335,Calendário!M333),\"\"))","v":""},null,null,{"$f":"IF(P333=\"\",\"\",_xlfn._xlws.FILTER(Base!$B:$B,Base!$A:$A=DATE(Calendário!AA336,Calendário!AA335,Calendário!P333),\"\"))","v":""},null,null,{"$f":"IF(S333=\"\",\"\",_xlfn._xlws.FILTER(Base!$B:$B,Base!$A:$A=DATE(Calendário!AA336,Calendário!AA335,Calendário!S333),\"\"))","v":""},null,null,{"$f":"IF(V333=\"\",\"\",_xlfn._xlws.FILTER(Base!$B:$B,Base!$A:$A=DATE(Calendário!AA336,Calendário!AA335,Calendário!V333),\"\"))","v":""},null,null,"Dia",1]
[null,null,null,null,null,null,null,null,null,null,null,null,null,null,null,null,null,null,null,null,null,null,null,null,null,"Mês",{"$f":"IF((AA270+1)>12,1,AA270+1)","v":5}]
[null,null,null,null,null,null,null,null,null,null,null,null,null,null,null,null,null,null,null,null,null,null,null,null,null,"Ano",{"$f":"IF((AA270+1)>12,AA271+1,AA271)","v":2024}]
[null,null,null,null,null,null,null,null,null,null,null,null,null,null,null,null,null,null,null,null,null,null,null,null,null,"Primeiro dia",{"$f":"DATE(AA336,AA335,1)","v":"2024-05-01"}]
[null,null,null,null,null,null,null,null,null,null,null,null,null,null,null,null,null,null,null,null,null,null,null,null,null,"Dia da Semana",{"$f":"WEEKDAY(AA337)","v":4}]
[null,null,null,null,null,null,null,null,null,null,null,null,null,null,null,null,null,null,null,null,null,null,null,null,null,"Último dia",{"$f":"EOMONTH(AA337,0)","v":"2024-05-31"}]
[null,null,null,{"$f":"V333+1","v":5},null,null,{"$f":"D340+1","v":6},null,null,{"$f":"G340+1","v":7},null,null,{"$f":"J340+1","v":8},null,null,{"$f":"M340+1","v":9},null,null,{"$f":"P340+1","v":10},null,null,{"$f":"S340+1","v":11},null,null,null,"Dia",{"$f":"DAY(AA339)","v":31}]
[null,null,null,null,{"$f":"IF(D340=\"\",\"\",_xlfn._xlws.FILTER(Base!$B:$B,Base!$A:$A=DATE(Calendário!AA336,Calendário!AA335,Calendário!D340),\"\"))","v":""},null,null,{"$f":"IF(G340=\"\",\"\",_xlfn._xlws.FILTER(Base!$B:$B,Base!$A:$A=DATE(Calendário!AA336,Calendário!AA335,Calendário!G340),\"\"))","v":""},null,null,{"$f":"IF(J340=\"\",\"\",_xlfn._xlws.FILTER(Base!$B:$B,Base!$A:$A=DATE(Calendário!AA336,Calendário!AA335,Calendário!J340),\"\"))","v":""},null,null,{"$f":"IF(M340=\"\",\"\",_xlfn._xlws.FILTER(Base!$B:$B,Base!$A:$A=DATE(Calendário!AA336,Calendário!AA335,Calendário!M340),\"\"))","v":""},null,null,{"$f":"IF(P340=\"\",\"\",_xlfn._xlws.FILTER(Base!$B:$B,Base!$A:$A=DATE(Calendário!AA336,Calendário!AA335,Calendário!P340),\"\"))","v":""},null,null,{"$f":"IF(S340=\"\",\"\",_xlfn._xlws.FILTER(Base!$B:$B,Base!$A:$A=DATE(Calendário!AA336,Calendário!AA335,Calendário!S340),\"\"))","v":""},null,null,{"$f":"IF(V340=\"\",\"\",_xlfn._xlws.FILTER(Base!$B:$B,Base!$A:$A=DATE(Calendário!AA336,Calendário!AA335,Calendário!V340),\"\"))","v":""}]
[]
[]
[]
[]
[]
[null,null,null,{"$f":"V340+1","v":12},null,null,{"$f":"D347+1","v":13},null,null,{"$f":"G347+1","v":14},null,null,{"$f":"J347+1","v":15},null,null,{"$f":"M347+1","v":16},null,null,{"$f":"P347+1","v":17},null,null,{"$f":"S347+1","v":18}]
[null,null,null,null,{"$f":"IF(D347=\"\",\"\",_xlfn._xlws.FILTER(Base!$B:$B,Base!$A:$A=DATE(Calendário!AA336,Calendário!AA335,Calendário!D347),\"\"))","v":""},null,null,{"$f":"IF(G347=\"\",\"\",_xlfn._xlws.FILTER(Base!$B:$B,Base!$A:$A=DATE(Calendário!AA336,Calendário!AA335,Calendário!G347),\"\"))","v":""},null,null,{"$f":"IF(J347=\"\",\"\",_xlfn._xlws.FILTER(Base!$B:$B,Base!$A:$A=DATE(Calendário!AA336,Calendário!AA335,Calendário!J347),\"\"))","v":""},null,null,{"$f":"IF(M347=\"\",\"\",_xlfn._xlws.FILTER(Base!$B:$B,Base!$A:$A=DATE(Calendário!AA336,Calendário!AA335,Calendário!M347),\"\"))","v":""},null,null,{"$f":"IF(P347=\"\",\"\",_xlfn._xlws.FILTER(Base!$B:$B,Base!$A:$A=DATE(Calendário!AA336,Calendário!AA335,Calendário!P347),\"\"))","v":""},null,null,{"$f":"IF(S347=\"\",\"\",_xlfn._xlws.FILTER(Base!$B:$B,Base!$A:$A=DATE(Calendário!AA336,Calendário!AA335,Calendário!S347),\"\"))","v":""},null,null,{"$f":"IF(V347=\"\",\"\",_xlfn._xlws.FILTER(Base!$B:$B,Base!$A:$A=DATE(Calendário!AA336,Calendário!AA335,Calendário!V347),\"\"))","v":""}]
[]
[]
[]
[]
[]
[null,null,null,{"$f":"V347+1","v":19},null,null,{"$f":"D354+1","v":20},null,null,{"$f":"G354+1","v":21},null,null,{"$f":"J354+1","v":22},null,null,{"$f":"M354+1","v":23},null,null,{"$f":"P354+1","v":24},null,null,{"$f":"S354+1","v":25}]
[null,null,null,null,{"$f":"IF(D354=\"\",\"\",_xlfn._xlws.FILTER(Base!$B:$B,Base!$A:$A=DATE(Calendário!AA336,Calendário!AA335,Calendário!D354),\"\"))","v":""},null,null,{"$f":"IF(G354=\"\",\"\",_xlfn._xlws.FILTER(Base!$B:$B,Base!$A:$A=DATE(Calendário!AA336,Calendário!AA335,Calendário!G354),\"\"))","v":""},null,null,{"$f":"IF(J354=\"\",\"\",_xlfn._xlws.FILTER(Base!$B:$B,Base!$A:$A=DATE(Calendário!AA336,Calendário!AA335,Calendário!J354),\"\"))","v":""},null,null,{"$f":"IF(M354=\"\",\"\",_xlfn._xlws.FILTER(Base!$B:$B,Base!$A:$A=DATE(Calendário!AA336,Calendário!AA335,Calendário!M354),\"\"))","v":""},null,null,{"$f":"IF(P354=\"\",\"\",_xlfn._xlws.FILTER(Base!$B:$B,Base!$A:$A=DATE(Calendário!AA336,Calendário!AA335,Calendário!P354),\"\"))","v":""},null,null,{"$f":"IF(S354=\"\",\"\",_xlfn._xlws.FILTER(Base!$B:$B,Base!$A:$A=DATE(Calendário!AA336,Calendário!AA335,Calendário!S354),\"\"))","v":""},null,null,{"$f":"IF(V354=\"\",\"\",_xlfn._xlws.FILTER(Base!$B:$B,Base!$A:$A=DATE(Calendário!AA336,Calendário!AA335,Calendário!V354),\"\"))","v":""}]
[]
[]
[]
[]
[]
[null,null,null,{"$f":"IF(V354=\"\",\"\",IF(V354+1>AA340,\"\",V354+1))","v":26},null,null,{"$f":"IF(D361=\"\",\"\",IF(D361+1>AA340,\"\",D361+1))","v":27},null,null,{"$f":"IF(G361=\"\",\"\",IF(G361+1>AA340,\"\",G361+1))","v":28},null,null,{"$f":"IF(J361=\"\",\"\",IF(J361+1>AA340,\"\",J361+1))","v":29},null,null,{"$f":"IF(M361=\"\",\"\",IF(M361+1>AA340,\"\",M361+1))","v":30},null,null,{"$f":"IF(P361=\"\",\"\",IF(P361+1>AA340,\"\",P361+1))","v":31},null,null,{"$f":"IF(S361=\"\",\"\",IF(S361+1>AA340,\"\",S361+1))","v":""}]
[null,null,null,null,{"$f":"IF(D361=\"\",\"\",_xlfn._xlws.FILTER(Base!$B:$B,Base!$A:$A=DATE(Calendário!AA336,Calendário!AA335,Calendário!D361),\"\"))","v":""},null,null,{"$f":"IF(G361=\"\",\"\",_xlfn._xlws.FILTER(Base!$B:$B,Base!$A:$A=DATE(Calendário!AA336,Calendário!AA335,Calendário!G361),\"\"))","v":""},null,null,{"$f":"IF(J361=\"\",\"\",_xlfn._xlws.FILTER(Base!$B:$B,Base!$A:$A=DATE(Calendário!AA336,Calendário!AA335,Calendário!J361),\"\"))","v":""},null,null,{"$f":"IF(M361=\"\",\"\",_xlfn._xlws.FILTER(Base!$B:$B,Base!$A:$A=DATE(Calendário!AA336,Calendário!AA335,Calendário!M361),\"\"))","v":""},null,null,{"$f":"IF(P361=\"\",\"\",_xlfn._xlws.FILTER(Base!$B:$B,Base!$A:$A=DATE(Calendário!AA336,Calendário!AA335,Calendário!P361),\"\"))","v":""},null,null,{"$f":"IF(S361=\"\",\"\",_xlfn._xlws.FILTER(Base!$B:$B,Base!$A:$A=DATE(Calendário!AA336,Calendário!AA335,Calendário!S361),\"\"))","v":""},null,null,{"$f":"IF(V361=\"\",\"\",_xlfn._xlws.FILTER(Base!$B:$B,Base!$A:$A=DATE(Calendário!AA336,Calendário!AA335,Calendário!V361),\"\"))","v":""}]
[]
[]
[]
[]
[]
[null,null,null,{"$f":"IF(V361=\"\",\"\",IF(V361+1>AA340,\"\",V361+1))","v":""},null,null,{"$f":"IF(D368=\"\",\"\",IF(D368+1>AA340,\"\",D368+1))","v":""},null,null,{"$f":"IF(G368=\"\",\"\",IF(G368+1>AA340,\"\",G368+1))","v":""},null,null,{"$f":"IF(J368=\"\",\"\",IF(J368+1>AA340,\"\",J368+1))","v":""},null,null,{"$f":"IF(M368=\"\",\"\",IF(M368+1>AA340,\"\",M368+1))","v":""},null,null,{"$f":"IF(P368=\"\",\"\",IF(P368+1>AA340,\"\",P368+1))","v":""},null,null,{"$f":"IF(S368=\"\",\"\",IF(S368+1>AA340,\"\",S368+1))","v":""}]
[null,null,null,null,{"$f":"IF(D368=\"\",\"\",_xlfn._xlws.FILTER(Base!$B:$B,Base!$A:$A=DATE(Calendário!AA336,Calendário!AA335,Calendário!D368),\"\"))","v":""},null,null,{"$f":"IF(G368=\"\",\"\",_xlfn._xlws.FILTER(Base!$B:$B,Base!$A:$A=DATE(Calendário!AA336,Calendário!AA335,Calendário!G368),\"\"))","v":""},null,null,{"$f":"IF(J368=\"\",\"\",_xlfn._xlws.FILTER(Base!$B:$B,Base!$A:$A=DATE(Calendário!AA336,Calendário!AA335,Calendário!J368),\"\"))","v":""},null,null,{"$f":"IF(M368=\"\",\"\",_xlfn._xlws.FILTER(Base!$B:$B,Base!$A:$A=DATE(Calendário!AA336,Calendário!AA335,Calendário!M368),\"\"))","v":""},null,null,{"$f":"IF(P368=\"\",\"\",_xlfn._xlws.FILTER(Base!$B:$B,Base!$A:$A=DATE(Calendário!AA336,Calendário!AA335,Calendário!P368),\"\"))","v":""},null,null,{"$f":"IF(S368=\"\",\"\",_xlfn._xlws.FILTER(Base!$B:$B,Base!$A:$A=DATE(Calendário!AA336,Calendário!AA335,Calendário!S368),\"\"))","v":""},null,null,{"$f":"IF(V368=\"\",\"\",_xlfn._xlws.FILTER(Base!$B:$B,Base!$A:$A=DATE(Calendário!AA336,Calendário!AA335,Calendário!V368),\"\"))","v":""}]
[]
[]
[]
[]
[]
[]
[]
[null,null,null,"Anotações"]
[]
[]
[]
[]
[]
[]
[]
[]
[]
[]
[]
[]
[]
[]
[]
[]
[]
[null,null,null,{"$f":"_xlfn.XLOOKUP(AA400,Base!$T$5:$T$16,Base!$U$5:$U$16,\"\",0,1)&\"|\"&AA401","v":"JUNHO|2024"}]
[null,null,null,1,null,null,2,null,null,3,null,null,4,null,null,5,null,null,6,null,null,7]
[null,null,null,"Domingo",null,null,"Segunda-feira",null,null,"Terça-feira",null,null,"Quarta-feira",null,null,"Quinta-feira",null,null,"Sexta-feira",null,null,"Sábado"]
[null,null,null,{"$f":"IF(D396=AA403,1,IF(C399=\"\",\"\",C399+1))","v":""},null,null,{"$f":"IF(G396=AA403,1,IF(D398=\"\",\"\",D398+1))","v":""},null,null,{"$f":"IF(J396=AA403,1,IF(G398=\"\",\"\",G398+1))","v":""},null,null,{"$f":"IF(M396=AA403,1,IF(J398=\"\",\"\",J398+1))","v":""},null,null,{"$f":"IF(P396=AA403,1,IF(M398=\"\",\"\",M398+1))","v":""},null,null,{"$f":"IF(S396=AA403,1,IF(P398=\"\",\"\",P398+1))","v":""},null,null,{"$f":"IF(V396=AA403,1,IF(S398=\"\",\"\",S398+1))","v":1}]
[null,null,null,null,{"$f":"IF(D398=\"\",\"\",_xlfn._xlws.FILTER(Base!$B:$B,Base!$A:$A=DATE(Calendário!AA401,Calendário!AA400,Calendário!D398),\"\"))","v":""},null,null,{"$f":"IF(G398=\"\",\"\",_xlfn._xlws.FILTER(Base!$B:$B,Base!$A:$A=DATE(Calendário!AA401,Calendário!AA400,Calendário!G398),\"\"))","v":""},null,null,{"$f":"IF(J398=\"\",\"\",_xlfn._xlws.FILTER(Base!$B:$B,Base!$A:$A=DATE(Calendário!AA401,Calendário!AA400,Calendário!J398),\"\"))","v":""},null,null,{"$f":"IF(M398=\"\",\"\",_xlfn._xlws.FILTER(Base!$B:$B,Base!$A:$A=DATE(Calendário!AA401,Calendário!AA400,Calendário!M398),\"\"))","v":""},null,null,{"$f":"IF(P398=\"\",\"\",_xlfn._xlws.FILTER(Base!$B:$B,Base!$A:$A=DATE(Calendário!AA401,Calendário!AA400,Calendário!P398),\"\"))","v":""},null,null,{"$f":"IF(S398=\"\",\"\",_xlfn._xlws.FILTER(Base!$B:$B,Base!$A:$A=DATE(Calendário!AA401,Calendário!AA400,Calendário!S398),\"\"))","v":""},null,null,{"$f":"IF(V398=\"\",\"\",_xlfn._xlws.FILTER(Base!$B:$B,Base!$A:$A=DATE(Calendário!AA401,Calendário!AA400,Calendário!V398),\"\"))","v":""},null,null,"Dia",1]
[null,null,null,null,null,null,null,null,null,null,null,null,null,null,null,null,null,null,null,null,null,null,null,null,null,"Mês",{"$f":"IF((AA335+1)>12,1,AA335+1)","v":6}]
[null,null,null,null,null,null,null,null,null,null,null,null,null,null,null,null,null,null,null,null,null,null,null,null,null,"Ano",{"$f":"IF((AA335+1)>12,AA336+1,AA336)","v":2024}]
[null,null,null,null,null,null,null,null,null,null,null,null,null,null,null,null,null,null,null,null,null,null,null,null,null,"Primeiro dia",{"$f":"DATE(AA401,AA400,1)","v":"2024-06-01"}]
[null,null,null,null,null,null,null,null,null,null,null,null,null,null,null,null,null,null,null,null,null,null,null,null,null,"Dia da Semana",{"$f":"WEEKDAY(AA402)","v":7}]
[null,null,null,null,null,null,null,null,null,null,null,null,null,null,null,null,null,null,null,null,null,null,null,null,null,"Último dia",{"$f":"EOMONTH(AA402,0)","v":"2024-06-30"}]
[null,null,null,{"$f":"V398+1","v":2},null,null,{"$f":"D405+1","v":3},null,null,{"$f":"G405+1","v":4},null,null,{"$f":"J405+1","v":5},null,null,{"$f":"M405+1","v":6},null,null,{"$f":"P405+1","v":7},null,null,{"$f":"S405+1","v":8},null,null,null,"Dia",{"$f":"DAY(AA404)","v":30}]
[null,null,null,null,{"$f":"IF(D405=\"\",\"\",_xlfn._xlws.FILTER(Base!$B:$B,Base!$A:$A=DATE(Calendário!AA401,Calendário!AA400,Calendário!D405),\"\"))","v":""},null,null,{"$f":"IF(G405=\"\",\"\",_xlfn._xlws.FILTER(Base!$B:$B,Base!$A:$A=DATE(Calendário!AA401,Calendário!AA400,Calendário!G405),\"\"))","v":""},null,null,{"$f":"IF(J405=\"\",\"\",_xlfn._xlws.FILTER(Base!$B:$B,Base!$A:$A=DATE(Calendário!AA401,Calendário!AA400,Calendário!J405),\"\"))","v":""},null,null,{"$f":"IF(M405=\"\",\"\",_xlfn._xlws.FILTER(Base!$B:$B,Base!$A:$A=DATE(Calendário!AA401,Calendário!AA400,Calendário!M405),\"\"))","v":""},null,null,{"$f":"IF(P405=\"\",\"\",_xlfn._xlws.FILTER(Base!$B:$B,Base!$A:$A=DATE(Calendário!AA401,Calendário!AA400,Calendário!P405),\"\"))","v":""},null,null,{"$f":"IF(S405=\"\",\"\",_xlfn._xlws.FILTER(Base!$B:$B,Base!$A:$A=DATE(Calendário!AA401,Calendário!AA400,Calendário!S405),\"\"))","v":""},null,null,{"$f":"IF(V405=\"\",\"\",_xlfn._xlws.FILTER(Base!$B:$B,Base!$A:$A=DATE(Calendário!AA401,Calendário!AA400,Calendário!V405),\"\"))","v":""}]
[]
[]
[]
[]
[]
[null,null,null,{"$f":"V405+1","v":9},null,null,{"$f":"D412+1","v":10},null,null,{"$f":"G412+1","v":11},null,null,{"$f":"J412+1","v":12},null,null,{"$f":"M412+1","v":13},null,null,{"$f":"P412+1","v":14},null,null,{"$f":"S412+1","v":15}]
[null,null,null,null,{"$f":"IF(D412=\"\",\"\",_xlfn._xlws.FILTER(Base!$B:$B,Base!$A:$A=DATE(Calendário!AA401,Calendário!AA400,Calendário!D412),\"\"))","v":""},null,null,{"$f":"IF(G412=\"\",\"\",_xlfn._xlws.FILTER(Base!$B:$B,Base!$A:$A=DATE(Calendário!AA401,Calendário!AA400,Calendário!G412),\"\"))","v":""},null,null,{"$f":"IF(J412=\"\",\"\",_xlfn._xlws.FILTER(Base!$B:$B,Base!$A:$A=DATE(Calendário!AA401,Calendário!AA400,Calendário!J412),\"\"))","v":""},null,null,{"$f":"IF(M412=\"\",\"\",_xlfn._xlws.FILTER(Base!$B:$B,Base!$A:$A=DATE(Calendário!AA401,Calendário!AA400,Calendário!M412),\"\"))","v":""},null,null,{"$f":"IF(P412=\"\",\"\",_xlfn._xlws.FILTER(Base!$B:$B,Base!$A:$A=DATE(Calendário!AA401,Calendário!AA400,Calendário!P412),\"\"))","v":""},null,null,{"$f":"IF(S412=\"\",\"\",_xlfn._xlws.FILTER(Base!$B:$B,Base!$A:$A=DATE(Calendário!AA401,Calendário!AA400,Calendário!S412),\"\"))","v":""},null,null,{"$f":"IF(V412=\"\",\"\",_xlfn._xlws.FILTER(Base!$B:$B,Base!$A:$A=DATE(Calendário!AA401,Calendário!AA400,Calendário!V412),\"\"))","v":""}]
[]
[]
[]
[]
[]
[null,null,null,{"$f":"V412+1","v":16},null,null,{"$f":"D419+1","v":17},null,null,{"$f":"G419+1","v":18},null,null,{"$f":"J419+1","v":19},null,null,{"$f":"M419+1","v":20},null,null,{"$f":"P419+1","v":21},null,null,{"$f":"S419+1","v":22}]
[null,null,null,null,{"$f":"IF(D419=\"\",\"\",_xlfn._xlws.FILTER(Base!$B:$B,Base!$A:$A=DATE(Calendário!AA401,Calendário!AA400,Calendário!D419),\"\"))","v":""},null,null,{"$f":"IF(G419=\"\",\"\",_xlfn._xlws.FILTER(Base!$B:$B,Base!$A:$A=DATE(Calendário!AA401,Calendário!AA400,Calendário!G419),\"\"))","v":""},null,null,{"$f":"IF(J419=\"\",\"\",_xlfn._xlws.FILTER(Base!$B:$B,Base!$A:$A=DATE(Calendário!AA401,Calendário!AA400,Calendário!J419),\"\"))","v":""},null,null,{"$f":"IF(M419=\"\",\"\",_xlfn._xlws.FILTER(Base!$B:$B,Base!$A:$A=DATE(Calendário!AA401,Calendário!AA400,Calendário!M419),\"\"))","v":""},null,null,{"$f":"IF(P419=\"\",\"\",_xlfn._xlws.FILTER(Base!$B:$B,Base!$A:$A=DATE(Calendário!AA401,Calendário!AA400,Calendário!P419),\"\"))","v":""},null,null,{"$f":"IF(S419=\"\",\"\",_xlfn._xlws.FILTER(Base!$B:$B,Base!$A:$A=DATE(Calendário!AA401,Calendário!AA400,Calendário!S419),\"\"))","v":""},null,null,{"$f":"IF(V419=\"\",\"\",_xlfn._xlws.FILTER(Base!$B:$B,Base!$A:$A=DATE(Calendário!AA401,Calendário!AA400,Calendário!V419),\"\"))","v":""}]
[]
[]
[]
[]
[]
[null,null,null,{"$f":"IF(V419=\"\",\"\",IF(V419+1>AA405,\"\",V419+1))","v":23},null,null,{"$f":"IF(D426=\"\",\"\",IF(D426+1>AA405,\"\",D426+1))","v":24},null,null,{"$f":"IF(G426=\"\",\"\",IF(G426+1>AA405,\"\",G426+1))","v":25},null,null,{"$f":"IF(J426=\"\",\"\",IF(J426+1>AA405,\"\",J426+1))","v":26},null,null,{"$f":"IF(M426=\"\",\"\",IF(M426+1>AA405,\"\",M426+1))","v":27},null,null,{"$f":"IF(P426=\"\",\"\",IF(P426+1>AA405,\"\",P426+1))","v":28},null,null,{"$f":"IF(S426=\"\",\"\",IF(S426+1>AA405,\"\",S426+1))","v":29}]
[null,null,null,null,{"$f":"IF(D426=\"\",\"\",_xlfn._xlws.FILTER(Base!$B:$B,Base!$A:$A=DATE(Calendário!AA401,Calendário!AA400,Calendário!D426),\"\"))","v":""},null,null,{"$f":"IF(G426=\"\",\"\",_xlfn._xlws.FILTER(Base!$B:$B,Base!$A:$A=DATE(Calendário!AA401,Calendário!AA400,Calendário!G426),\"\"))","v":""},null,null,{"$f":"IF(J426=\"\",\"\",_xlfn._xlws.FILTER(Base!$B:$B,Base!$A:$A=DATE(Calendário!AA401,Calendário!AA400,Calendário!J426),\"\"))","v":""},null,null,{"$f":"IF(M426=\"\",\"\",_xlfn._xlws.FILTER(Base!$B:$B,Base!$A:$A=DATE(Calendário!AA401,Calendário!AA400,Calendário!M426),\"\"))","v":""},null,null,{"$f":"IF(P426=\"\",\"\",_xlfn._xlws.FILTER(Base!$B:$B,Base!$A:$A=DATE(Calendário!AA401,Calendário!AA400,Calendário!P426),\"\"))","v":""},null,null,{"$f":"IF(S426=\"\",\"\",_xlfn._xlws.FILTER(Base!$B:$B,Base!$A:$A=DATE(Calendário!AA401,Calendário!AA400,Calendário!S426),\"\"))","v":""},null,null,{"$f":"IF(V426=\"\",\"\",_xlfn._xlws.FILTER(Base!$B:$B,Base!$A:$A=DATE(Calendário!AA401,Calendário!AA400,Calendário!V426),\"\"))","v":""}]
[]
[]
[]
[]
[]
[null,null,null,{"$f":"IF(V426=\"\",\"\",IF(V426+1>AA405,\"\",V426+1))","v":30},null,null,{"$f":"IF(D433=\"\",\"\",IF(D433+1>AA405,\"\",D433+1))","v":""},null,null,{"$f":"IF(G433=\"\",\"\",IF(G433+1>AA405,\"\",G433+1))","v":""},null,null,{"$f":"IF(J433=\"\",\"\",IF(J433+1>AA405,\"\",J433+1))","v":""},null,null,{"$f":"IF(M433=\"\",\"\",IF(M433+1>AA405,\"\",M433+1))","v":""},null,null,{"$f":"IF(P433=\"\",\"\",IF(P433+1>AA405,\"\",P433+1))","v":""},null,null,{"$f":"IF(S433=\"\",\"\",IF(S433+1>AA405,\"\",S433+1))","v":""}]
[null,null,null,null,{"$f":"IF(D433=\"\",\"\",_xlfn._xlws.FILTER(Base!$B:$B,Base!$A:$A=DATE(Calendário!AA401,Calendário!AA400,Calendário!D433),\"\"))","v":""},null,null,{"$f":"IF(G433=\"\",\"\",_xlfn._xlws.FILTER(Base!$B:$B,Base!$A:$A=DATE(Calendário!AA401,Calendário!AA400,Calendário!G433),\"\"))","v":""},null,null,{"$f":"IF(J433=\"\",\"\",_xlfn._xlws.FILTER(Base!$B:$B,Base!$A:$A=DATE(Calendário!AA401,Calendário!AA400,Calendário!J433),\"\"))","v":""},null,null,{"$f":"IF(M433=\"\",\"\",_xlfn._xlws.FILTER(Base!$B:$B,Base!$A:$A=DATE(Calendário!AA401,Calendário!AA400,Calendário!M433),\"\"))","v":""},null,null,{"$f":"IF(P433=\"\",\"\",_xlfn._xlws.FILTER(Base!$B:$B,Base!$A:$A=DATE(Calendário!AA401,Calendário!AA400,Calendário!P433),\"\"))","v":""},null,null,{"$f":"IF(S433=\"\",\"\",_xlfn._xlws.FILTER(Base!$B:$B,Base!$A:$A=DATE(Calendário!AA401,Calendário!AA400,Calendário!S433),\"\"))","v":""},null,null,{"$f":"IF(V433=\"\",\"\",_xlfn._xlws.FILTER(Base!$B:$B,Base!$A:$A=DATE(Calendário!AA401,Calendário!AA400,Calendário!V433),\"\"))","v":""}]
[]
[]
[]
[]
[]
[]
[]
[null,null,null,"Anotações"]
[]
[]
[]
[]
[]
[]
[]
[]
[]
[]
[]
[]
[]
[]
[]
[]
[]
[null,null,null,{"$f":"_xlfn.XLOOKUP(AA465,Base!$T$5:$T$16,Base!$U$5:$U$16,\"\",0,1)&\"|\"&AA466","v":"JULHO|2024"}]
[null,null,null,1,null,null,2,null,null,3,null,null,4,null,null,5,null,null,6,null,null,7]
[null,null,null,"Domingo",null,null,"Segunda-feira",null,null,"Terça-feira",null,null,"Quarta-feira",null,null,"Quinta-feira",null,null,"Sexta-feira",null,null,"Sábado"]
[null,null,null,{"$f":"IF(D461=AA468,1,IF(C464=\"\",\"\",C464+1))","v":""},null,null,{"$f":"IF(G461=AA468,1,IF(D463=\"\",\"\",D463+1))","v":1},null,null,{"$f":"IF(J461=AA468,1,IF(G463=\"\",\"\",G463+1))","v":2},null,null,{"$f":"IF(M461=AA468,1,IF(J463=\"\",\"\",J463+1))","v":3},null,null,{"$f":"IF(P461=AA468,1,IF(M463=\"\",\"\",M463+1))","v":4},null,null,{"$f":"IF(S461=AA468,1,IF(P463=\"\",\"\",P463+1))","v":5},null,null,{"$f":"IF(V461=AA468,1,IF(S463=\"\",\"\",S463+1))","v":6}]
[null,null,null,null,{"$f":"IF(D463=\"\",\"\",_xlfn._xlws.FILTER(Base!$B:$B,Base!$A:$A=DATE(Calendário!AA466,Calendário!AA465,Calendário!D463),\"\"))","v":""},null,null,{"$f":"IF(G463=\"\",\"\",_xlfn._xlws.FILTER(Base!$B:$B,Base!$A:$A=DATE(Calendário!AA466,Calendário!AA465,Calendário!G463),\"\"))","v":""},null,null,{"$f":"IF(J463=\"\",\"\",_xlfn._xlws.FILTER(Base!$B:$B,Base!$A:$A=DATE(Calendário!AA466,Calendário!AA465,Calendário!J463),\"\"))","v":""},null,null,{"$f":"IF(M463=\"\",\"\",_xlfn._xlws.FILTER(Base!$B:$B,Base!$A:$A=DATE(Calendário!AA466,Calendário!AA465,Calendário!M463),\"\"))","v":""},null,null,{"$f":"IF(P463=\"\",\"\",_xlfn._xlws.FILTER(Base!$B:$B,Base!$A:$A=DATE(Calendário!AA466,Calendário!AA465,Calendário!P463),\"\"))","v":""},null,null,{"$f":"IF(S463=\"\",\"\",_xlfn._xlws.FILTER(Base!$B:$B,Base!$A:$A=DATE(Calendário!AA466,Calendário!AA465,Calendário!S463),\"\"))","v":""},null,null,{"$f":"IF(V463=\"\",\"\",_xlfn._xlws.FILTER(Base!$B:$B,Base!$A:$A=DATE(Calendário!AA466,Calendário!AA465,Calendário!V463),\"\"))","v":""},null,null,"Dia",1]
[null,null,null,null,null,null,null,null,null,null,null,null,null,null,null,null,null,null,null,null,null,null,null,null,null,"Mês",{"$f":"IF((AA400+1)>12,1,AA400+1)","v":7}]
[null,null,null,null,null,null,null,null,null,null,null,null,null,null,null,null,null,null,null,null,null,null,null,null,null,"Ano",{"$f":"IF((AA400+1)>12,AA401+1,AA401)","v":2024}]
[null,null,null,null,null,null,null,null,null,null,null,null,null,null,null,null,null,null,null,null,null,null,null,null,null,"Primeiro dia",{"$f":"DATE(AA466,AA465,1)","v":"2024-07-01"}]
[null,null,null,null,null,null,null,null,null,null,null,null,null,null,null,null,null,null,null,null,null,null,null,null,null,"Dia da Semana",{"$f":"WEEKDAY(AA467)","v":2}]
[null,null,null,null,null,null,null,null,null,null,null,null,null,null,null,null,null,null,null,null,null,null,null,null,null,"Último dia",{"$f":"EOMONTH(AA467,0)","v":"2024-07-31"}]
[null,null,null,{"$f":"V463+1","v":7},null,null,{"$f":"D470+1","v":8},null,null,{"$f":"G470+1","v":9},null,null,{"$f":"J470+1","v":10},null,null,{"$f":"M470+1","v":11},null,null,{"$f":"P470+1","v":12},null,null,{"$f":"S470+1","v":13},null,null,null,"Dia",{"$f":"DAY(AA469)","v":31}]
[null,null,null,null,{"$f":"IF(D470=\"\",\"\",_xlfn._xlws.FILTER(Base!$B:$B,Base!$A:$A=DATE(Calendário!AA466,Calendário!AA465,Calendário!D470),\"\"))","v":""},null,null,{"$f":"IF(G470=\"\",\"\",_xlfn._xlws.FILTER(Base!$B:$B,Base!$A:$A=DATE(Calendário!AA466,Calendário!AA465,Calendário!G470),\"\"))","v":""},null,null,{"$f":"IF(J470=\"\",\"\",_xlfn._xlws.FILTER(Base!$B:$B,Base!$A:$A=DATE(Calendário!AA466,Calendário!AA465,Calendário!J470),\"\"))","v":""},null,null,{"$f":"IF(M470=\"\",\"\",_xlfn._xlws.FILTER(Base!$B:$B,Base!$A:$A=DATE(Calendário!AA466,Calendário!AA465,Calendário!M470),\"\"))","v":""},null,null,{"$f":"IF(P470=\"\",\"\",_xlfn._xlws.FILTER(Base!$B:$B,Base!$A:$A=DATE(Calendário!AA466,Calendário!AA465,Calendário!P470),\"\"))","v":""},null,null,{"$f":"IF(S470=\"\",\"\",_xlfn._xlws.FILTER(Base!$B:$B,Base!$A:$A=DATE(Calendário!AA466,Calendário!AA465,Calendário!S470),\"\"))","v":""},null,null,{"$f":"IF(V470=\"\",\"\",_xlfn._xlws.FILTER(Base!$B:$B,Base!$A:$A=DATE(Calendário!AA466,Calendário!AA465,Calendário!V470),\"\"))","v":""}]
[]
[]
[]
[]
[]
[null,null,null,{"$f":"V470+1","v":14},null,null,{"$f":"D477+1","v":15},null,null,{"$f":"G477+1","v":16},null,null,{"$f":"J477+1","v":17},null,null,{"$f":"M477+1","v":18},null,null,{"$f":"P477+1","v":19},null,null,{"$f":"S477+1","v":20}]
[null,null,null,null,{"$f":"IF(D477=\"\",\"\",_xlfn._xlws.FILTER(Base!$B:$B,Base!$A:$A=DATE(Calendário!AA466,Calendário!AA465,Calendário!D477),\"\"))","v":""},null,null,{"$f":"IF(G477=\"\",\"\",_xlfn._xlws.FILTER(Base!$B:$B,Base!$A:$A=DATE(Calendário!AA466,Calendário!AA465,Calendário!G477),\"\"))","v":""},null,null,{"$f":"IF(J477=\"\",\"\",_xlfn._xlws.FILTER(Base!$B:$B,Base!$A:$A=DATE(Calendário!AA466,Calendário!AA465,Calendário!J477),\"\"))","v":""},null,null,{"$f":"IF(M477=\"\",\"\",_xlfn._xlws.FILTER(Base!$B:$B,Base!$A:$A=DATE(Calendário!AA466,Calendário!AA465,Calendário!M477),\"\"))","v":""},null,null,{"$f":"IF(P477=\"\",\"\",_xlfn._xlws.FILTER(Base!$B:$B,Base!$A:$A=DATE(Calendário!AA466,Calendário!AA465,Calendário!P477),\"\"))","v":""},null,null,{"$f":"IF(S477=\"\",\"\",_xlfn._xlws.FILTER(Base!$B:$B,Base!$A:$A=DATE(Calendário!AA466,Calendário!AA465,Calendário!S477),\"\"))","v":""},null,null,{"$f":"IF(V477=\"\",\"\",_xlfn._xlws.FILTER(Base!$B:$B,Base!$A:$A=DATE(Calendário!AA466,Calendário!AA465,Calendário!V477),\"\"))","v":""}]
[]
[]
[]
[]
[]
[null,null,null,{"$f":"V477+1","v":21},null,null,{"$f":"D484+1","v":22},null,null,{"$f":"G484+1","v":23},null,null,{"$f":"J484+1","v":24},null,null,{"$f":"M484+1","v":25},null,null,{"$f":"P484+1","v":26},null,null,{"$f":"S484+1","v":27}]
[null,null,null,null,{"$f":"IF(D484=\"\",\"\",_xlfn._xlws.FILTER(Base!$B:$B,Base!$A:$A=DATE(Calendário!AA466,Calendário!AA465,Calendário!D484),\"\"))","v":""},null,null,{"$f":"IF(G484=\"\",\"\",_xlfn._xlws.FILTER(Base!$B:$B,Base!$A:$A=DATE(Calendário!AA466,Calendário!AA465,Calendário!G484),\"\"))","v":""},null,null,{"$f":"IF(J484=\"\",\"\",_xlfn._xlws.FILTER(Base!$B:$B,Base!$A:$A=DATE(Calendário!AA466,Calendário!AA465,Calendário!J484),\"\"))","v":""},null,null,{"$f":"IF(M484=\"\",\"\",_xlfn._xlws.FILTER(Base!$B:$B,Base!$A:$A=DATE(Calendário!AA466,Calendário!AA465,Calendário!M484),\"\"))","v":""},null,null,{"$f":"IF(P484=\"\",\"\",_xlfn._xlws.FILTER(Base!$B:$B,Base!$A:$A=DATE(Calendário!AA466,Calendário!AA465,Calendário!P484),\"\"))","v":""},null,null,{"$f":"IF(S484=\"\",\"\",_xlfn._xlws.FILTER(Base!$B:$B,Base!$A:$A=DATE(Calendário!AA466,Calendário!AA465,Calendário!S484),\"\"))","v":""},null,null,{"$f":"IF(V484=\"\",\"\",_xlfn._xlws.FILTER(Base!$B:$B,Base!$A:$A=DATE(Calendário!AA466,Calendário!AA465,Calendário!V484),\"\"))","v":""}]
[]
[]
[]
[]
[]
[null,null,null,{"$f":"IF(V484=\"\",\"\",IF(V484+1>AA470,\"\",V484+1))","v":28},null,null,{"$f":"IF(D491=\"\",\"\",IF(D491+1>AA470,\"\",D491+1))","v":29},null,null,{"$f":"IF(G491=\"\",\"\",IF(G491+1>AA470,\"\",G491+1))","v":30},null,null,{"$f":"IF(J491=\"\",\"\",IF(J491+1>AA470,\"\",J491+1))","v":31},null,null,{"$f":"IF(M491=\"\",\"\",IF(M491+1>AA470,\"\",M491+1))","v":""},null,null,{"$f":"IF(P491=\"\",\"\",IF(P491+1>AA470,\"\",P491+1))","v":""},null,null,{"$f":"IF(S491=\"\",\"\",IF(S491+1>AA470,\"\",S491+1))","v":""}]
[null,null,null,null,{"$f":"IF(D491=\"\",\"\",_xlfn._xlws.FILTER(Base!$B:$B,Base!$A:$A=DATE(Calendário!AA466,Calendário!AA465,Calendário!D491),\"\"))","v":""},null,null,{"$f":"IF(G491=\"\",\"\",_xlfn._xlws.FILTER(Base!$B:$B,Base!$A:$A=DATE(Calendário!AA466,Calendário!AA465,Calendário!G491),\"\"))","v":""},null,null,{"$f":"IF(J491=\"\",\"\",_xlfn._xlws.FILTER(Base!$B:$B,Base!$A:$A=DATE(Calendário!AA466,Calendário!AA465,Calendário!J491),\"\"))","v":""},null,null,{"$f":"IF(M491=\"\",\"\",_xlfn._xlws.FILTER(Base!$B:$B,Base!$A:$A=DATE(Calendário!AA466,Calendário!AA465,Calendário!M491),\"\"))","v":""},null,null,{"$f":"IF(P491=\"\",\"\",_xlfn._xlws.FILTER(Base!$B:$B,Base!$A:$A=DATE(Calendário!AA466,Calendário!AA465,Calendário!P491),\"\"))","v":""},null,null,{"$f":"IF(S491=\"\",\"\",_xlfn._xlws.FILTER(Base!$B:$B,Base!$A:$A=DATE(Calendário!AA466,Calendário!AA465,Calendário!S491),\"\"))","v":""},null,null,{"$f":"IF(V491=\"\",\"\",_xlfn._xlws.FILTER(Base!$B:$B,Base!$A:$A=DATE(Calendário!AA466,Calendário!AA465,Calendário!V491),\"\"))","v":""}]
[]
[]
[]
[]
[]
[null,null,null,{"$f":"IF(V491=\"\",\"\",IF(V491+1>AA470,\"\",V491+1))","v":""},null,null,{"$f":"IF(D498=\"\",\"\",IF(D498+1>AA470,\"\",D498+1))","v":""},null,null,{"$f":"IF(G498=\"\",\"\",IF(G498+1>AA470,\"\",G498+1))","v":""},null,null,{"$f":"IF(J498=\"\",\"\",IF(J498+1>AA470,\"\",J498+1))","v":""},null,null,{"$f":"IF(M498=\"\",\"\",IF(M498+1>AA470,\"\",M498+1))","v":""},null,null,{"$f":"IF(P498=\"\",\"\",IF(P498+1>AA470,\"\",P498+1))","v":""},null,null,{"$f":"IF(S498=\"\",\"\",IF(S498+1>AA470,\"\",S498+1))","v":""}]
[null,null,null,null,{"$f":"IF(D498=\"\",\"\",_xlfn._xlws.FILTER(Base!$B:$B,Base!$A:$A=DATE(Calendário!AA466,Calendário!AA465,Calendário!D498),\"\"))","v":""},null,null,{"$f":"IF(G498=\"\",\"\",_xlfn._xlws.FILTER(Base!$B:$B,Base!$A:$A=DATE(Calendário!AA466,Calendário!AA465,Calendário!G498),\"\"))","v":""},null,null,{"$f":"IF(J498=\"\",\"\",_xlfn._xlws.FILTER(Base!$B:$B,Base!$A:$A=DATE(Calendário!AA466,Calendário!AA465,Calendário!J498),\"\"))","v":""},null,null,{"$f":"IF(M498=\"\",\"\",_xlfn._xlws.FILTER(Base!$B:$B,Base!$A:$A=DATE(Calendário!AA466,Calendário!AA465,Calendário!M498),\"\"))","v":""},null,null,{"$f":"IF(P498=\"\",\"\",_xlfn._xlws.FILTER(Base!$B:$B,Base!$A:$A=DATE(Calendário!AA466,Calendário!AA465,Calendário!P498),\"\"))","v":""},null,null,{"$f":"IF(S498=\"\",\"\",_xlfn._xlws.FILTER(Base!$B:$B,Base!$A:$A=DATE(Calendário!AA466,Calendário!AA465,Calendário!S498),\"\"))","v":""},null,null,{"$f":"IF(V498=\"\",\"\",_xlfn._xlws.FILTER(Base!$B:$B,Base!$A:$A=DATE(Calendário!AA466,Calendário!AA465,Calendário!V498),\"\"))","v":""}]
[]
[]
[]
[]
[]
[]
[]
[null,null,null,"Anotações"]
[]
[]
[]
[]
[]
[]
[]
[]
[]
[]
[]
[]
[]
[]
[]
[]
[]
[null,null,null,{"$f":"_xlfn.XLOOKUP(AA530,Base!$T$5:$T$16,Base!$U$5:$U$16,\"\",0,1)&\"|\"&AA531","v":"AGOSTO|2024"}]
[null,null,null,1,null,null,2,null,null,3,null,null,4,null,null,5,null,null,6,null,null,7]
[null,null,null,"Domingo",null,null,"Segunda-feira",null,null,"Terça-feira",null,null,"Quarta-feira",null,null,"Quinta-feira",null,null,"Sexta-feira",null,null,"Sábado"]
[null,null,null,{"$f":"IF(D526=AA533,1,IF(C529=\"\",\"\",C529+1))","v":""},null,null,{"$f":"IF(G526=AA533,1,IF(D528=\"\",\"\",D528+1))","v":""},null,null,{"$f":"IF(J526=AA533,1,IF(G528=\"\",\"\",G528+1))","v":""},null,null,{"$f":"IF(M526=AA533,1,IF(J528=\"\",\"\",J528+1))","v":""},null,null,{"$f":"IF(P526=AA533,1,IF(M528=\"\",\"\",M528+1))","v":1},null,null,{"$f":"IF(S526=AA533,1,IF(P528=\"\",\"\",P528+1))","v":2},null,null,{"$f":"IF(V526=AA533,1,IF(S528=\"\",\"\",S528+1))","v":3}]
[null,null,null,null,{"$f":"IF(D528=\"\",\"\",_xlfn._xlws.FILTER(Base!$B:$B,Base!$A:$A=DATE(Calendário!AA531,Calendário!AA530,Calendário!D528),\"\"))","v":""},null,null,{"$f":"IF(G528=\"\",\"\",_xlfn._xlws.FILTER(Base!$B:$B,Base!$A:$A=DATE(Calendário!AA531,Calendário!AA530,Calendário!G528),\"\"))","v":""},null,null,{"$f":"IF(J528=\"\",\"\",_xlfn._xlws.FILTER(Base!$B:$B,Base!$A:$A=DATE(Calendário!AA531,Calendário!AA530,Calendário!J528),\"\"))","v":""},null,null,{"$f":"IF(M528=\"\",\"\",_xlfn._xlws.FILTER(Base!$B:$B,Base!$A:$A=DATE(Calendário!AA531,Calendário!AA530,Calendário!M528),\"\"))","v":""},null,null,{"$f":"IF(P528=\"\",\"\",_xlfn._xlws.FILTER(Base!$B:$B,Base!$A:$A=DATE(Calendário!AA531,Calendário!AA530,Calendário!P528),\"\"))","v":""},null,null,{"$f":"IF(S528=\"\",\"\",_xlfn._xlws.FILTER(Base!$B:$B,Base!$A:$A=DATE(Calendário!AA531,Calendário!AA530,Calendário!S528),\"\"))","v":""},null,null,{"$f":"IF(V528=\"\",\"\",_xlfn._xlws.FILTER(Base!$B:$B,Base!$A:$A=DATE(Calendário!AA531,Calendário!AA530,Calendário!V528),\"\"))","v":""},null,null,"Dia",1]
[null,null,null,null,null,null,null,null,null,null,null,null,null,null,null,null,null,null,null,null,null,null,null,null,null,"Mês",{"$f":"IF((AA465+1)>12,1,AA465+1)","v":8}]
[null,null,null,null,null,null,null,null,null,null,null,null,null,null,null,null,null,null,null,null,null,null,null,null,null,"Ano",{"$f":"IF((AA465+1)>12,AA466+1,AA466)","v":2024}]
[null,null,null,null,null,null,null,null,null,null,null,null,null,null,null,null,null,null,null,null,null,null,null,null,null,"Primeiro dia",{"$f":"DATE(AA531,AA530,1)","v":"2024-08-01"}]
[null,null,null,null,null,null,null,null,null,null,null,null,null,null,null,null,null,null,null,null,null,null,null,null,null,"Dia da Semana",{"$f":"WEEKDAY(AA532)","v":5}]
[null,null,null,null,null,null,null,null,null,null,null,null,null,null,null,null,null,null,null,null,null,null,null,null,null,"Último dia",{"$f":"EOMONTH(AA532,0)","v":"2024-08-31"}]
[null,null,null,{"$f":"V528+1","v":4},null,null,{"$f":"D535+1","v":5},null,null,{"$f":"G535+1","v":6},null,null,{"$f":"J535+1","v":7},null,null,{"$f":"M535+1","v":8},null,null,{"$f":"P535+1","v":9},null,null,{"$f":"S535+1","v":10},null,null,null,"Dia",{"$f":"DAY(AA534)","v":31}]
[null,null,null,null,{"$f":"IF(D535=\"\",\"\",_xlfn._xlws.FILTER(Base!$B:$B,Base!$A:$A=DATE(Calendário!AA531,Calendário!AA530,Calendário!D535),\"\"))","v":""},null,null,{"$f":"IF(G535=\"\",\"\",_xlfn._xlws.FILTER(Base!$B:$B,Base!$A:$A=DATE(Calendário!AA531,Calendário!AA530,Calendário!G535),\"\"))","v":""},null,null,{"$f":"IF(J535=\"\",\"\",_xlfn._xlws.FILTER(Base!$B:$B,Base!$A:$A=DATE(Calendário!AA531,Calendário!AA530,Calendário!J535),\"\"))","v":""},null,null,{"$f":"IF(M535=\"\",\"\",_xlfn._xlws.FILTER(Base!$B:$B,Base!$A:$A=DATE(Calendário!AA531,Calendário!AA530,Calendário!M535),\"\"))","v":""},null,null,{"$f":"IF(P535=\"\",\"\",_xlfn._xlws.FILTER(Base!$B:$B,Base!$A:$A=DATE(Calendário!AA531,Calendário!AA530,Calendário!P535),\"\"))","v":""},null,null,{"$f":"IF(S535=\"\",\"\",_xlfn._xlws.FILTER(Base!$B:$B,Base!$A:$A=DATE(Calendário!AA531,Calendário!AA530,Calendário!S535),\"\"))","v":""},null,null,{"$f":"IF(V535=\"\",\"\",_xlfn._xlws.FILTER(Base!$B:$B,Base!$A:$A=DATE(Calendário!AA531,Calendário!AA530,Calendário!V535),\"\"))","v":""}]
[]
[]
[]
[]
[]
[null,null,null,{"$f":"V535+1","v":11},null,null,{"$f":"D542+1","v":12},null,null,{"$f":"G542+1","v":13},null,null,{"$f":"J542+1","v":14},null,null,{"$f":"M542+1","v":15},null,null,{"$f":"P542+1","v":16},null,null,{"$f":"S542+1","v":17}]
[null,null,null,null,{"$f":"IF(D542=\"\",\"\",_xlfn._xlws.FILTER(Base!$B:$B,Base!$A:$A=DATE(Calendário!AA531,Calendário!AA530,Calendário!D542),\"\"))","v":""},null,null,{"$f":"IF(G542=\"\",\"\",_xlfn._xlws.FILTER(Base!$B:$B,Base!$A:$A=DATE(Calendário!AA531,Calendário!AA530,Calendário!G542),\"\"))","v":""},null,null,{"$f":"IF(J542=\"\",\"\",_xlfn._xlws.FILTER(Base!$B:$B,Base!$A:$A=DATE(Calendário!AA531,Calendário!AA530,Calendário!J542),\"\"))","v":""},null,null,{"$f":"IF(M542=\"\",\"\",_xlfn._xlws.FILTER(Base!$B:$B,Base!$A:$A=DATE(Calendário!AA531,Calendário!AA530,Calendário!M542),\"\"))","v":""},null,null,{"$f":"IF(P542=\"\",\"\",_xlfn._xlws.FILTER(Base!$B:$B,Base!$A:$A=DATE(Calendário!AA531,Calendário!AA530,Calendário!P542),\"\"))","v":""},null,null,{"$f":"IF(S542=\"\",\"\",_xlfn._xlws.FILTER(Base!$B:$B,Base!$A:$A=DATE(Calendário!AA531,Calendário!AA530,Calendário!S542),\"\"))","v":""},null,null,{"$f":"IF(V542=\"\",\"\",_xlfn._xlws.FILTER(Base!$B:$B,Base!$A:$A=DATE(Calendário!AA531,Calendário!AA530,Calendário!V542),\"\"))","v":""}]
[]
[]
[]
[]
[]
[null,null,null,{"$f":"V542+1","v":18},null,null,{"$f":"D549+1","v":19},null,null,{"$f":"G549+1","v":20},null,null,{"$f":"J549+1","v":21},null,null,{"$f":"M549+1","v":22},null,null,{"$f":"P549+1","v":23},null,null,{"$f":"S549+1","v":24}]
[null,null,null,null,{"$f":"IF(D549=\"\",\"\",_xlfn._xlws.FILTER(Base!$B:$B,Base!$A:$A=DATE(Calendário!AA531,Calendário!AA530,Calendário!D549),\"\"))","v":""},null,null,{"$f":"IF(G549=\"\",\"\",_xlfn._xlws.FILTER(Base!$B:$B,Base!$A:$A=DATE(Calendário!AA531,Calendário!AA530,Calendário!G549),\"\"))","v":""},null,null,{"$f":"IF(J549=\"\",\"\",_xlfn._xlws.FILTER(Base!$B:$B,Base!$A:$A=DATE(Calendário!AA531,Calendário!AA530,Calendário!J549),\"\"))","v":""},null,null,{"$f":"IF(M549=\"\",\"\",_xlfn._xlws.FILTER(Base!$B:$B,Base!$A:$A=DATE(Calendário!AA531,Calendário!AA530,Calendário!M549),\"\"))","v":""},null,null,{"$f":"IF(P549=\"\",\"\",_xlfn._xlws.FILTER(Base!$B:$B,Base!$A:$A=DATE(Calendário!AA531,Calendário!AA530,Calendário!P549),\"\"))","v":""},null,null,{"$f":"IF(S549=\"\",\"\",_xlfn._xlws.FILTER(Base!$B:$B,Base!$A:$A=DATE(Calendário!AA531,Calendário!AA530,Calendário!S549),\"\"))","v":""},null,null,{"$f":"IF(V549=\"\",\"\",_xlfn._xlws.FILTER(Base!$B:$B,Base!$A:$A=DATE(Calendário!AA531,Calendário!AA530,Calendário!V549),\"\"))","v":""}]
[]
[]
[]
[]
[]
[null,null,null,{"$f":"IF(V549=\"\",\"\",IF(V549+1>AA535,\"\",V549+1))","v":25},null,null,{"$f":"IF(D556=\"\",\"\",IF(D556+1>AA535,\"\",D556+1))","v":26},null,null,{"$f":"IF(G556=\"\",\"\",IF(G556+1>AA535,\"\",G556+1))","v":27},null,null,{"$f":"IF(J556=\"\",\"\",IF(J556+1>AA535,\"\",J556+1))","v":28},null,null,{"$f":"IF(M556=\"\",\"\",IF(M556+1>AA535,\"\",M556+1))","v":29},null,null,{"$f":"IF(P556=\"\",\"\",IF(P556+1>AA535,\"\",P556+1))","v":30},null,null,{"$f":"IF(S556=\"\",\"\",IF(S556+1>AA535,\"\",S556+1))","v":31}]
[null,null,null,null,{"$f":"IF(D556=\"\",\"\",_xlfn._xlws.FILTER(Base!$B:$B,Base!$A:$A=DATE(Calendário!AA531,Calendário!AA530,Calendário!D556),\"\"))","v":""},null,null,{"$f":"IF(G556=\"\",\"\",_xlfn._xlws.FILTER(Base!$B:$B,Base!$A:$A=DATE(Calendário!AA531,Calendário!AA530,Calendário!G556),\"\"))","v":""},null,null,{"$f":"IF(J556=\"\",\"\",_xlfn._xlws.FILTER(Base!$B:$B,Base!$A:$A=DATE(Calendário!AA531,Calendário!AA530,Calendário!J556),\"\"))","v":""},null,null,{"$f":"IF(M556=\"\",\"\",_xlfn._xlws.FILTER(Base!$B:$B,Base!$A:$A=DATE(Calendário!AA531,Calendário!AA530,Calendário!M556),\"\"))","v":""},null,null,{"$f":"IF(P556=\"\",\"\",_xlfn._xlws.FILTER(Base!$B:$B,Base!$A:$A=DATE(Calendário!AA531,Calendário!AA530,Calendário!P556),\"\"))","v":""},null,null,{"$f":"IF(S556=\"\",\"\",_xlfn._xlws.FILTER(Base!$B:$B,Base!$A:$A=DATE(Calendário!AA531,Calendário!AA530,Calendário!S556),\"\"))","v":""},null,null,{"$f":"IF(V556=\"\",\"\",_xlfn._xlws.FILTER(Base!$B:$B,Base!$A:$A=DATE(Calendário!AA531,Calendário!AA530,Calendário!V556),\"\"))","v":""}]
[]
[]
[]
[]
[]
[null,null,null,{"$f":"IF(V556=\"\",\"\",IF(V556+1>AA535,\"\",V556+1))","v":""},null,null,{"$f":"IF(D563=\"\",\"\",IF(D563+1>AA535,\"\",D563+1))","v":""},null,null,{"$f":"IF(G563=\"\",\"\",IF(G563+1>AA535,\"\",G563+1))","v":""},null,null,{"$f":"IF(J563=\"\",\"\",IF(J563+1>AA535,\"\",J563+1))","v":""},null,null,{"$f":"IF(M563=\"\",\"\",IF(M563+1>AA535,\"\",M563+1))","v":""},null,null,{"$f":"IF(P563=\"\",\"\",IF(P563+1>AA535,\"\",P563+1))","v":""},null,null,{"$f":"IF(S563=\"\",\"\",IF(S563+1>AA535,\"\",S563+1))","v":""}]
[null,null,null,null,{"$f":"IF(D563=\"\",\"\",_xlfn._xlws.FILTER(Base!$B:$B,Base!$A:$A=DATE(Calendário!AA531,Calendário!AA530,Calendário!D563),\"\"))","v":""},null,null,{"$f":"IF(G563=\"\",\"\",_xlfn._xlws.FILTER(Base!$B:$B,Base!$A:$A=DATE(Calendário!AA531,Calendário!AA530,Calendário!G563),\"\"))","v":""},null,null,{"$f":"IF(J563=\"\",\"\",_xlfn._xlws.FILTER(Base!$B:$B,Base!$A:$A=DATE(Calendário!AA531,Calendário!AA530,Calendário!J563),\"\"))","v":""},null,null,{"$f":"IF(M563=\"\",\"\",_xlfn._xlws.FILTER(Base!$B:$B,Base!$A:$A=DATE(Calendário!AA531,Calendário!AA530,Calendário!M563),\"\"))","v":""},null,null,{"$f":"IF(P563=\"\",\"\",_xlfn._xlws.FILTER(Base!$B:$B,Base!$A:$A=DATE(Calendário!AA531,Calendário!AA530,Calendário!P563),\"\"))","v":""},null,null,{"$f":"IF(S563=\"\",\"\",_xlfn._xlws.FILTER(Base!$B:$B,Base!$A:$A=DATE(Calendário!AA531,Calendário!AA530,Calendário!S563),\"\"))","v":""},null,null,{"$f":"IF(V563=\"\",\"\",_xlfn._xlws.FILTER(Base!$B:$B,Base!$A:$A=DATE(Calendário!AA531,Calendário!AA530,Calendário!V563),\"\"))","v":""}]
[]
[]
[]
[]
[]
[]
[]
[null,null,null,"Anotações"]
[]
[]
[]
[]
[]
[]
[]
[]
[]
[]
[]
[]
[]
[]
[]
[]
[]
[null,null,null,{"$f":"_xlfn.XLOOKUP(AA595,Base!$T$5:$T$16,Base!$U$5:$U$16,\"\",0,1)&\"|\"&AA596","v":"SETEMBRO|2024"}]
[null,null,null,1,null,null,2,null,null,3,null,null,4,null,null,5,null,null,6,null,null,7]
[null,null,null,"Domingo",null,null,"Segunda-feira",null,null,"Terça-feira",null,null,"Quarta-feira",null,null,"Quinta-feira",null,null,"Sexta-feira",null,null,"Sábado"]
[null,null,null,{"$f":"IF(D591=AA598,1,IF(C594=\"\",\"\",C594+1))","v":1},null,null,{"$f":"IF(G591=AA598,1,IF(D593=\"\",\"\",D593+1))","v":2},null,null,{"$f":"IF(J591=AA598,1,IF(G593=\"\",\"\",G593+1))","v":3},null,null,{"$f":"IF(M591=AA598,1,IF(J593=\"\",\"\",J593+1))","v":4},null,null,{"$f":"IF(P591=AA598,1,IF(M593=\"\",\"\",M593+1))","v":5},null,null,{"$f":"IF(S591=AA598,1,IF(P593=\"\",\"\",P593+1))","v":6},null,null,{"$f":"IF(V591=AA598,1,IF(S593=\"\",\"\",S593+1))","v":7}]
[null,null,null,null,{"$f":"IF(D593=\"\",\"\",_xlfn._xlws.FILTER(Base!$B:$B,Base!$A:$A=DATE(Calendário!AA596,Calendário!AA595,Calendário!D593),\"\"))","v":""},null,null,{"$f":"IF(G593=\"\",\"\",_xlfn._xlws.FILTER(Base!$B:$B,Base!$A:$A=DATE(Calendário!AA596,Calendário!AA595,Calendário!G593),\"\"))","v":""},null,null,{"$f":"IF(J593=\"\",\"\",_xlfn._xlws.FILTER(Base!$B:$B,Base!$A:$A=DATE(Calendário!AA596,Calendário!AA595,Calendário!J593),\"\"))","v":""},null,null,{"$f":"IF(M593=\"\",\"\",_xlfn._xlws.FILTER(Base!$B:$B,Base!$A:$A=DATE(Calendário!AA596,Calendário!AA595,Calendário!M593),\"\"))","v":""},null,null,{"$f":"IF(P593=\"\",\"\",_xlfn._xlws.FILTER(Base!$B:$B,Base!$A:$A=DATE(Calendário!AA596,Calendário!AA595,Calendário!P593),\"\"))","v":""},null,null,{"$f":"IF(S593=\"\",\"\",_xlfn._xlws.FILTER(Base!$B:$B,Base!$A:$A=DATE(Calendário!AA596,Calendário!AA595,Calendário!S593),\"\"))","v":""},null,null,{"$f":"IF(V593=\"\",\"\",_xlfn._xlws.FILTER(Base!$B:$B,Base!$A:$A=DATE(Calendário!AA596,Calendário!AA595,Calendário!V593),\"\"))","v":""},null,null,"Dia",1]
[null,null,null,null,null,null,null,null,null,null,null,null,null,null,null,null,null,null,null,null,null,null,null,null,null,"Mês",{"$f":"IF((AA530+1)>12,1,AA530+1)","v":9}]
[null,null,null,null,null,null,null,null,null,null,null,null,null,null,null,null,null,null,null,null,null,null,null,null,null,"Ano",{"$f":"IF((AA530+1)>12,AA531+1,AA531)","v":2024}]
[null,null,null,null,null,null,null,null,null,null,null,null,null,null,null,null,null,null,null,null,null,null,null,null,null,"Primeiro dia",{"$f":"DATE(AA596,AA595,1)","v":"2024-09-01"}]
[null,null,null,null,null,null,null,null,null,null,null,null,null,null,null,null,null,null,null,null,null,null,null,null,null,"Dia da Semana",{"$f":"WEEKDAY(AA597)","v":1}]
[null,null,null,null,null,null,null,null,null,null,null,null,null,null,null,null,null,null,null,null,null,null,null,null,null,"Último dia",{"$f":"EOMONTH(AA597,0)","v":"2024-09-30"}]
[null,null,null,{"$f":"V593+1","v":8},null,null,{"$f":"D600+1","v":9},null,null,{"$f":"G600+1","v":10},null,null,{"$f":"J600+1","v":11},null,null,{"$f":"M600+1","v":12},null,null,{"$f":"P600+1","v":13},null,null,{"$f":"S600+1","v":14},null,null,null,"Dia",{"$f":"DAY(AA599)","v":30}]
[null,null,null,null,{"$f":"IF(D600=\"\",\"\",_xlfn._xlws.FILTER(Base!$B:$B,Base!$A:$A=DATE(Calendário!AA596,Calendário!AA595,Calendário!D600),\"\"))","v":""},null,null,{"$f":"IF(G600=\"\",\"\",_xlfn._xlws.FILTER(Base!$B:$B,Base!$A:$A=DATE(Calendário!AA596,Calendário!AA595,Calendário!G600),\"\"))","v":""},null,null,{"$f":"IF(J600=\"\",\"\",_xlfn._xlws.FILTER(Base!$B:$B,Base!$A:$A=DATE(Calendário!AA596,Calendário!AA595,Calendário!J600),\"\"))","v":""},null,null,{"$f":"IF(M600=\"\",\"\",_xlfn._xlws.FILTER(Base!$B:$B,Base!$A:$A=DATE(Calendário!AA596,Calendário!AA595,Calendário!M600),\"\"))","v":""},null,null,{"$f":"IF(P600=\"\",\"\",_xlfn._xlws.FILTER(Base!$B:$B,Base!$A:$A=DATE(Calendário!AA596,Calendário!AA595,Calendário!P600),\"\"))","v":""},null,null,{"$f":"IF(S600=\"\",\"\",_xlfn._xlws.FILTER(Base!$B:$B,Base!$A:$A=DATE(Calendário!AA596,Calendário!AA595,Calendário!S600),\"\"))","v":""},null,null,{"$f":"IF(V600=\"\",\"\",_xlfn._xlws.FILTER(Base!$B:$B,Base!$A:$A=DATE(Calendário!AA596,Calendário!AA595,Calendário!V600),\"\"))","v":""}]
[]
[]
[]
[]
[]
[null,null,null,{"$f":"V600+1","v":15},null,null,{"$f":"D607+1","v":16},null,null,{"$f":"G607+1","v":17},null,null,{"$f":"J607+1","v":18},null,null,{"$f":"M607+1","v":19},null,null,{"$f":"P607+1","v":20},null,null,{"$f":"S607+1","v":21}]
[null,null,null,null,{"$f":"IF(D607=\"\",\"\",_xlfn._xlws.FILTER(Base!$B:$B,Base!$A:$A=DATE(Calendário!AA596,Calendário!AA595,Calendário!D607),\"\"))","v":""},null,null,{"$f":"IF(G607=\"\",\"\",_xlfn._xlws.FILTER(Base!$B:$B,Base!$A:$A=DATE(Calendário!AA596,Calendário!AA595,Calendário!G607),\"\"))","v":""},null,null,{"$f":"IF(J607=\"\",\"\",_xlfn._xlws.FILTER(Base!$B:$B,Base!$A:$A=DATE(Calendário!AA596,Calendário!AA595,Calendário!J607),\"\"))","v":""},null,null,{"$f":"IF(M607=\"\",\"\",_xlfn._xlws.FILTER(Base!$B:$B,Base!$A:$A=DATE(Calendário!AA596,Calendário!AA595,Calendário!M607),\"\"))","v":""},null,null,{"$f":"IF(P607=\"\",\"\",_xlfn._xlws.FILTER(Base!$B:$B,Base!$A:$A=DATE(Calendário!AA596,Calendário!AA595,Calendário!P607),\"\"))","v":""},null,null,{"$f":"IF(S607=\"\",\"\",_xlfn._xlws.FILTER(Base!$B:$B,Base!$A:$A=DATE(Calendário!AA596,Calendário!AA595,Calendário!S607),\"\"))","v":""},null,null,{"$f":"IF(V607=\"\",\"\",_xlfn._xlws.FILTER(Base!$B:$B,Base!$A:$A=DATE(Calendário!AA596,Calendário!AA595,Calendário!V607),\"\"))","v":""}]
[]
[]
[]
[]
[]
[null,null,null,{"$f":"V607+1","v":22},null,null,{"$f":"D614+1","v":23},null,null,{"$f":"G614+1","v":24},null,null,{"$f":"J614+1","v":25},null,null,{"$f":"M614+1","v":26},null,null,{"$f":"P614+1","v":27},null,null,{"$f":"S614+1","v":28}]
[null,null,null,null,{"$f":"IF(D614=\"\",\"\",_xlfn._xlws.FILTER(Base!$B:$B,Base!$A:$A=DATE(Calendário!AA596,Calendário!AA595,Calendário!D614),\"\"))","v":""},null,null,{"$f":"IF(G614=\"\",\"\",_xlfn._xlws.FILTER(Base!$B:$B,Base!$A:$A=DATE(Calendário!AA596,Calendário!AA595,Calendário!G614),\"\"))","v":""},null,null,{"$f":"IF(J614=\"\",\"\",_xlfn._xlws.FILTER(Base!$B:$B,Base!$A:$A=DATE(Calendário!AA596,Calendário!AA595,Calendário!J614),\"\"))","v":""},null,null,{"$f":"IF(M614=\"\",\"\",_xlfn._xlws.FILTER(Base!$B:$B,Base!$A:$A=DATE(Calendário!AA596,Calendário!AA595,Calendário!M614),\"\"))","v":""},null,null,{"$f":"IF(P614=\"\",\"\",_xlfn._xlws.FILTER(Base!$B:$B,Base!$A:$A=DATE(Calendário!AA596,Calendário!AA595,Calendário!P614),\"\"))","v":""},null,null,{"$f":"IF(S614=\"\",\"\",_xlfn._xlws.FILTER(Base!$B:$B,Base!$A:$A=DATE(Calendário!AA596,Calendário!AA595,Calendário!S614),\"\"))","v":""},null,null,{"$f":"IF(V614=\"\",\"\",_xlfn._xlws.FILTER(Base!$B:$B,Base!$A:$A=DATE(Calendário!AA596,Calendário!AA595,Calendário!V614),\"\"))","v":""}]
[]
[]
[]
[]
[]
[null,null,null,{"$f":"IF(V614=\"\",\"\",IF(V614+1>AA600,\"\",V614+1))","v":29},null,null,{"$f":"IF(D621=\"\",\"\",IF(D621+1>AA600,\"\",D621+1))","v":30},null,null,{"$f":"IF(G621=\"\",\"\",IF(G621+1>AA600,\"\",G621+1))","v":""},null,null,{"$f":"IF(J621=\"\",\"\",IF(J621+1>AA600,\"\",J621+1))","v":""},null,null,{"$f":"IF(M621=\"\",\"\",IF(M621+1>AA600,\"\",M621+1))","v":""},null,null,{"$f":"IF(P621=\"\",\"\",IF(P621+1>AA600,\"\",P621+1))","v":""},null,null,{"$f":"IF(S621=\"\",\"\",IF(S621+1>AA600,\"\",S621+1))","v":""}]
[null,null,null,null,{"$f":"IF(D621=\"\",\"\",_xlfn._xlws.FILTER(Base!$B:$B,Base!$A:$A=DATE(Calendário!AA596,Calendário!AA595,Calendário!D621),\"\"))","v":""},null,null,{"$f":"IF(G621=\"\",\"\",_xlfn._xlws.FILTER(Base!$B:$B,Base!$A:$A=DATE(Calendário!AA596,Calendário!AA595,Calendário!G621),\"\"))","v":""},null,null,{"$f":"IF(J621=\"\",\"\",_xlfn._xlws.FILTER(Base!$B:$B,Base!$A:$A=DATE(Calendário!AA596,Calendário!AA595,Calendário!J621),\"\"))","v":""},null,null,{"$f":"IF(M621=\"\",\"\",_xlfn._xlws.FILTER(Base!$B:$B,Base!$A:$A=DATE(Calendário!AA596,Calendário!AA595,Calendário!M621),\"\"))","v":""},null,null,{"$f":"IF(P621=\"\",\"\",_xlfn._xlws.FILTER(Base!$B:$B,Base!$A:$A=DATE(Calendário!AA596,Calendário!AA595,Calendário!P621),\"\"))","v":""},null,null,{"$f":"IF(S621=\"\",\"\",_xlfn._xlws.FILTER(Base!$B:$B,Base!$A:$A=DATE(Calendário!AA596,Calendário!AA595,Calendário!S621),\"\"))","v":""},null,null,{"$f":"IF(V621=\"\",\"\",_xlfn._xlws.FILTER(Base!$B:$B,Base!$A:$A=DATE(Calendário!AA596,Calendário!AA595,Calendário!V621),\"\"))","v":""}]
[]
[]
[]
[]
[]
[null,null,null,{"$f":"IF(V621=\"\",\"\",IF(V621+1>AA600,\"\",V621+1))","v":""},null,null,{"$f":"IF(D628=\"\",\"\",IF(D628+1>AA600,\"\",D628+1))","v":""},null,null,{"$f":"IF(G628=\"\",\"\",IF(G628+1>AA600,\"\",G628+1))","v":""},null,null,{"$f":"IF(J628=\"\",\"\",IF(J628+1>AA600,\"\",J628+1))","v":""},null,null,{"$f":"IF(M628=\"\",\"\",IF(M628+1>AA600,\"\",M628+1))","v":""},null,null,{"$f":"IF(P628=\"\",\"\",IF(P628+1>AA600,\"\",P628+1))","v":""},null,null,{"$f":"IF(S628=\"\",\"\",IF(S628+1>AA600,\"\",S628+1))","v":""}]
[null,null,null,null,{"$f":"IF(D628=\"\",\"\",_xlfn._xlws.FILTER(Base!$B:$B,Base!$A:$A=DATE(Calendário!AA596,Calendário!AA595,Calendário!D628),\"\"))","v":""},null,null,{"$f":"IF(G628=\"\",\"\",_xlfn._xlws.FILTER(Base!$B:$B,Base!$A:$A=DATE(Calendário!AA596,Calendário!AA595,Calendário!G628),\"\"))","v":""},null,null,{"$f":"IF(J628=\"\",\"\",_xlfn._xlws.FILTER(Base!$B:$B,Base!$A:$A=DATE(Calendário!AA596,Calendário!AA595,Calendário!J628),\"\"))","v":""},null,null,{"$f":"IF(M628=\"\",\"\",_xlfn._xlws.FILTER(Base!$B:$B,Base!$A:$A=DATE(Calendário!AA596,Calendário!AA595,Calendário!M628),\"\"))","v":""},null,null,{"$f":"IF(P628=\"\",\"\",_xlfn._xlws.FILTER(Base!$B:$B,Base!$A:$A=DATE(Calendário!AA596,Calendário!AA595,Calendário!P628),\"\"))","v":""},null,null,{"$f":"IF(S628=\"\",\"\",_xlfn._xlws.FILTER(Base!$B:$B,Base!$A:$A=DATE(Calendário!AA596,Calendário!AA595,Calendário!S628),\"\"))","v":""},null,null,{"$f":"IF(V628=\"\",\"\",_xlfn._xlws.FILTER(Base!$B:$B,Base!$A:$A=DATE(Calendário!AA596,Calendário!AA595,Calendário!V628),\"\"))","v":""}]
[]
[]
[]
[]
[]
[]
[]
[null,null,null,"Anotações"]
[]
[]
[]
[]
[]
[]
[]
[]
[]
[]
[]
[]
[]
[]
[]
[]
[]
[null,null,null,{"$f":"_xlfn.XLOOKUP(AA660,Base!$T$5:$T$16,Base!$U$5:$U$16,\"\",0,1)&\"|\"&AA661","v":"OUTUBRO|2024"}]
[null,null,null,1,null,null,2,null,null,3,null,null,4,null,null,5,null,null,6,null,null,7]
[null,null,null,"Domingo",null,null,"Segunda-feira",null,null,"Terça-feira",null,null,"Quarta-feira",null,null,"Quinta-feira",null,null,"Sexta-feira",null,null,"Sábado"]
[null,null,null,{"$f":"IF(D656=AA663,1,IF(C659=\"\",\"\",C659+1))","v":""},null,null,{"$f":"IF(G656=AA663,1,IF(D658=\"\",\"\",D658+1))","v":""},null,null,{"$f":"IF(J656=AA663,1,IF(G658=\"\",\"\",G658+1))","v":1},null,null,{"$f":"IF(M656=AA663,1,IF(J658=\"\",\"\",J658+1))","v":2},null,null,{"$f":"IF(P656=AA663,1,IF(M658=\"\",\"\",M658+1))","v":3},null,null,{"$f":"IF(S656=AA663,1,IF(P658=\"\",\"\",P658+1))","v":4},null,null,{"$f":"IF(V656=AA663,1,IF(S658=\"\",\"\",S658+1))","v":5}]
[null,null,null,null,{"$f":"IF(D658=\"\",\"\",_xlfn._xlws.FILTER(Base!$B:$B,Base!$A:$A=DATE(Calendário!AA661,Calendário!AA660,Calendário!D658),\"\"))","v":""},null,null,{"$f":"IF(G658=\"\",\"\",_xlfn._xlws.FILTER(Base!$B:$B,Base!$A:$A=DATE(Calendário!AA661,Calendário!AA660,Calendário!G658),\"\"))","v":""},null,null,{"$f":"IF(J658=\"\",\"\",_xlfn._xlws.FILTER(Base!$B:$B,Base!$A:$A=DATE(Calendário!AA661,Calendário!AA660,Calendário!J658),\"\"))","v":""},null,null,{"$f":"IF(M658=\"\",\"\",_xlfn._xlws.FILTER(Base!$B:$B,Base!$A:$A=DATE(Calendário!AA661,Calendário!AA660,Calendário!M658),\"\"))","v":""},null,null,{"$f":"IF(P658=\"\",\"\",_xlfn._xlws.FILTER(Base!$B:$B,Base!$A:$A=DATE(Calendário!AA661,Calendário!AA660,Calendário!P658),\"\"))","v":""},null,null,{"$f":"IF(S658=\"\",\"\",_xlfn._xlws.FILTER(Base!$B:$B,Base!$A:$A=DATE(Calendário!AA661,Calendário!AA660,Calendário!S658),\"\"))","v":""},null,null,{"$f":"IF(V658=\"\",\"\",_xlfn._xlws.FILTER(Base!$B:$B,Base!$A:$A=DATE(Calendário!AA661,Calendário!AA660,Calendário!V658),\"\"))","v":""},null,null,"Dia",1]
[null,null,null,null,null,null,null,null,null,null,null,null,null,null,null,null,null,null,null,null,null,null,null,null,null,"Mês",{"$f":"IF((AA595+1)>12,1,AA595+1)","v":10}]
[null,null,null,null,null,null,null,null,null,null,null,null,null,null,null,null,null,null,null,null,null,null,null,null,null,"Ano",{"$f":"IF((AA595+1)>12,AA596+1,AA596)","v":2024}]
[null,null,null,null,null,null,null,null,null,null,null,null,null,null,null,null,null,null,null,null,null,null,null,null,null,"Primeiro dia",{"$f":"DATE(AA661,AA660,1)","v":"2024-10-01"}]
[null,null,null,null,null,null,null,null,null,null,null,null,null,null,null,null,null,null,null,null,null,null,null,null,null,"Dia da Semana",{"$f":"WEEKDAY(AA662)","v":3}]
[null,null,null,null,null,null,null,null,null,null,null,null,null,null,null,null,null,null,null,null,null,null,null,null,null,"Último dia",{"$f":"EOMONTH(AA662,0)","v":"2024-10-31"}]
[null,null,null,{"$f":"V658+1","v":6},null,null,{"$f":"D665+1","v":7},null,null,{"$f":"G665+1","v":8},null,null,{"$f":"J665+1","v":9},null,null,{"$f":"M665+1","v":10},null,null,{"$f":"P665+1","v":11},null,null,{"$f":"S665+1","v":12},null,null,null,"Dia",{"$f":"DAY(AA664)","v":31}]
[null,null,null,null,{"$f":"IF(D665=\"\",\"\",_xlfn._xlws.FILTER(Base!$B:$B,Base!$A:$A=DATE(Calendário!AA661,Calendário!AA660,Calendário!D665),\"\"))","v":""},null,null,{"$f":"IF(G665=\"\",\"\",_xlfn._xlws.FILTER(Base!$B:$B,Base!$A:$A=DATE(Calendário!AA661,Calendário!AA660,Calendário!G665),\"\"))","v":""},null,null,{"$f":"IF(J665=\"\",\"\",_xlfn._xlws.FILTER(Base!$B:$B,Base!$A:$A=DATE(Calendário!AA661,Calendário!AA660,Calendário!J665),\"\"))","v":""},null,null,{"$f":"IF(M665=\"\",\"\",_xlfn._xlws.FILTER(Base!$B:$B,Base!$A:$A=DATE(Calendário!AA661,Calendário!AA660,Calendário!M665),\"\"))","v":""},null,null,{"$f":"IF(P665=\"\",\"\",_xlfn._xlws.FILTER(Base!$B:$B,Base!$A:$A=DATE(Calendário!AA661,Calendário!AA660,Calendário!P665),\"\"))","v":""},null,null,{"$f":"IF(S665=\"\",\"\",_xlfn._xlws.FILTER(Base!$B:$B,Base!$A:$A=DATE(Calendário!AA661,Calendário!AA660,Calendário!S665),\"\"))","v":""},null,null,{"$f":"IF(V665=\"\",\"\",_xlfn._xlws.FILTER(Base!$B:$B,Base!$A:$A=DATE(Calendário!AA661,Calendário!AA660,Calendário!V665),\"\"))","v":""}]
[]
[]
[]
[]
[]
[null,null,null,{"$f":"V665+1","v":13},null,null,{"$f":"D672+1","v":14},null,null,{"$f":"G672+1","v":15},null,null,{"$f":"J672+1","v":16},null,null,{"$f":"M672+1","v":17},null,null,{"$f":"P672+1","v":18},null,null,{"$f":"S672+1","v":19}]
[null,null,null,null,{"$f":"IF(D672=\"\",\"\",_xlfn._xlws.FILTER(Base!$B:$B,Base!$A:$A=DATE(Calendário!AA661,Calendário!AA660,Calendário!D672),\"\"))","v":""},null,null,{"$f":"IF(G672=\"\",\"\",_xlfn._xlws.FILTER(Base!$B:$B,Base!$A:$A=DATE(Calendário!AA661,Calendário!AA660,Calendário!G672),\"\"))","v":""},null,null,{"$f":"IF(J672=\"\",\"\",_xlfn._xlws.FILTER(Base!$B:$B,Base!$A:$A=DATE(Calendário!AA661,Calendário!AA660,Calendário!J672),\"\"))","v":""},null,null,{"$f":"IF(M672=\"\",\"\",_xlfn._xlws.FILTER(Base!$B:$B,Base!$A:$A=DATE(Calendário!AA661,Calendário!AA660,Calendário!M672),\"\"))","v":""},null,null,{"$f":"IF(P672=\"\",\"\",_xlfn._xlws.FILTER(Base!$B:$B,Base!$A:$A=DATE(Calendário!AA661,Calendário!AA660,Calendário!P672),\"\"))","v":""},null,null,{"$f":"IF(S672=\"\",\"\",_xlfn._xlws.FILTER(Base!$B:$B,Base!$A:$A=DATE(Calendário!AA661,Calendário!AA660,Calendário!S672),\"\"))","v":""},null,null,{"$f":"IF(V672=\"\",\"\",_xlfn._xlws.FILTER(Base!$B:$B,Base!$A:$A=DATE(Calendário!AA661,Calendário!AA660,Calendário!V672),\"\"))","v":""}]
[]
[]
[]
[]
[]
[null,null,null,{"$f":"V672+1","v":20},null,null,{"$f":"D679+1","v":21},null,null,{"$f":"G679+1","v":22},null,null,{"$f":"J679+1","v":23},null,null,{"$f":"M679+1","v":24},null,null,{"$f":"P679+1","v":25},null,null,{"$f":"S679+1","v":26}]
[null,null,null,null,{"$f":"IF(D679=\"\",\"\",_xlfn._xlws.FILTER(Base!$B:$B,Base!$A:$A=DATE(Calendário!AA661,Calendário!AA660,Calendário!D679),\"\"))","v":""},null,null,{"$f":"IF(G679=\"\",\"\",_xlfn._xlws.FILTER(Base!$B:$B,Base!$A:$A=DATE(Calendário!AA661,Calendário!AA660,Calendário!G679),\"\"))","v":""},null,null,{"$f":"IF(J679=\"\",\"\",_xlfn._xlws.FILTER(Base!$B:$B,Base!$A:$A=DATE(Calendário!AA661,Calendário!AA660,Calendário!J679),\"\"))","v":""},null,null,{"$f":"IF(M679=\"\",\"\",_xlfn._xlws.FILTER(Base!$B:$B,Base!$A:$A=DATE(Calendário!AA661,Calendário!AA660,Calendário!M679),\"\"))","v":""},null,null,{"$f":"IF(P679=\"\",\"\",_xlfn._xlws.FILTER(Base!$B:$B,Base!$A:$A=DATE(Calendário!AA661,Calendário!AA660,Calendário!P679),\"\"))","v":""},null,null,{"$f":"IF(S679=\"\",\"\",_xlfn._xlws.FILTER(Base!$B:$B,Base!$A:$A=DATE(Calendário!AA661,Calendário!AA660,Calendário!S679),\"\"))","v":""},null,null,{"$f":"IF(V679=\"\",\"\",_xlfn._xlws.FILTER(Base!$B:$B,Base!$A:$A=DATE(Calendário!AA661,Calendário!AA660,Calendário!V679),\"\"))","v":""}]
[]
[]
[]
[]
[]
[null,null,null,{"$f":"IF(V679=\"\",\"\",IF(V679+1>AA665,\"\",V679+1))","v":27},null,null,{"$f":"IF(D686=\"\",\"\",IF(D686+1>AA665,\"\",D686+1))","v":28},null,null,{"$f":"IF(G686=\"\",\"\",IF(G686+1>AA665,\"\",G686+1))","v":29},null,null,{"$f":"IF(J686=\"\",\"\",IF(J686+1>AA665,\"\",J686+1))","v":30},null,null,{"$f":"IF(M686=\"\",\"\",IF(M686+1>AA665,\"\",M686+1))","v":31},null,null,{"$f":"IF(P686=\"\",\"\",IF(P686+1>AA665,\"\",P686+1))","v":""},null,null,{"$f":"IF(S686=\"\",\"\",IF(S686+1>AA665,\"\",S686+1))","v":""}]
[null,null,null,null,{"$f":"IF(D686=\"\",\"\",_xlfn._xlws.FILTER(Base!$B:$B,Base!$A:$A=DATE(Calendário!AA661,Calendário!AA660,Calendário!D686),\"\"))","v":""},null,null,{"$f":"IF(G686=\"\",\"\",_xlfn._xlws.FILTER(Base!$B:$B,Base!$A:$A=DATE(Calendário!AA661,Calendário!AA660,Calendário!G686),\"\"))","v":""},null,null,{"$f":"IF(J686=\"\",\"\",_xlfn._xlws.FILTER(Base!$B:$B,Base!$A:$A=DATE(Calendário!AA661,Calendário!AA660,Calendário!J686),\"\"))","v":""},null,null,{"$f":"IF(M686=\"\",\"\",_xlfn._xlws.FILTER(Base!$B:$B,Base!$A:$A=DATE(Calendário!AA661,Calendário!AA660,Calendário!M686),\"\"))","v":""},null,null,{"$f":"IF(P686=\"\",\"\",_xlfn._xlws.FILTER(Base!$B:$B,Base!$A:$A=DATE(Calendário!AA661,Calendário!AA660,Calendário!P686),\"\"))","v":""},null,null,{"$f":"IF(S686=\"\",\"\",_xlfn._xlws.FILTER(Base!$B:$B,Base!$A:$A=DATE(Calendário!AA661,Calendário!AA660,Calendário!S686),\"\"))","v":""},null,null,{"$f":"IF(V686=\"\",\"\",_xlfn._xlws.FILTER(Base!$B:$B,Base!$A:$A=DATE(Calendário!AA661,Calendário!AA660,Calendário!V686),\"\"))","v":""}]
[]
[]
[]
[]
[]
[null,null,null,{"$f":"IF(V686=\"\",\"\",IF(V686+1>AA665,\"\",V686+1))","v":""},null,null,{"$f":"IF(D693=\"\",\"\",IF(D693+1>AA665,\"\",D693+1))","v":""},null,null,{"$f":"IF(G693=\"\",\"\",IF(G693+1>AA665,\"\",G693+1))","v":""},null,null,{"$f":"IF(J693=\"\",\"\",IF(J693+1>AA665,\"\",J693+1))","v":""},null,null,{"$f":"IF(M693=\"\",\"\",IF(M693+1>AA665,\"\",M693+1))","v":""},null,null,{"$f":"IF(P693=\"\",\"\",IF(P693+1>AA665,\"\",P693+1))","v":""},null,null,{"$f":"IF(S693=\"\",\"\",IF(S693+1>AA665,\"\",S693+1))","v":""}]
[null,null,null,null,{"$f":"IF(D693=\"\",\"\",_xlfn._xlws.FILTER(Base!$B:$B,Base!$A:$A=DATE(Calendário!AA661,Calendário!AA660,Calendário!D693),\"\"))","v":""},null,null,{"$f":"IF(G693=\"\",\"\",_xlfn._xlws.FILTER(Base!$B:$B,Base!$A:$A=DATE(Calendário!AA661,Calendário!AA660,Calendário!G693),\"\"))","v":""},null,null,{"$f":"IF(J693=\"\",\"\",_xlfn._xlws.FILTER(Base!$B:$B,Base!$A:$A=DATE(Calendário!AA661,Calendário!AA660,Calendário!J693),\"\"))","v":""},null,null,{"$f":"IF(M693=\"\",\"\",_xlfn._xlws.FILTER(Base!$B:$B,Base!$A:$A=DATE(Calendário!AA661,Calendário!AA660,Calendário!M693),\"\"))","v":""},null,null,{"$f":"IF(P693=\"\",\"\",_xlfn._xlws.FILTER(Base!$B:$B,Base!$A:$A=DATE(Calendário!AA661,Calendário!AA660,Calendário!P693),\"\"))","v":""},null,null,{"$f":"IF(S693=\"\",\"\",_xlfn._xlws.FILTER(Base!$B:$B,Base!$A:$A=DATE(Calendário!AA661,Calendário!AA660,Calendário!S693),\"\"))","v":""},null,null,{"$f":"IF(V693=\"\",\"\",_xlfn._xlws.FILTER(Base!$B:$B,Base!$A:$A=DATE(Calendário!AA661,Calendário!AA660,Calendário!V693),\"\"))","v":""}]
[]
[]
[]
[]
[]
[]
[]
[null,null,null,"Anotações"]
[]
[]
[]
[]
[]
[]
[]
[]
[]
[]
[]
[]
[]
[]
[]
[]
[]
[null,null,null,{"$f":"_xlfn.XLOOKUP(AA725,Base!$T$5:$T$16,Base!$U$5:$U$16,\"\",0,1)&\"|\"&AA726","v":"NOVEMBRO|2024"}]
[null,null,null,1,null,null,2,null,null,3,null,null,4,null,null,5,null,null,6,null,null,7]
[null,null,null,"Domingo",null,null,"Segunda-feira",null,null,"Terça-feira",null,null,"Quarta-feira",null,null,"Quinta-feira",null,null,"Sexta-feira",null,null,"Sábado"]
[null,null,null,{"$f":"IF(D721=AA728,1,IF(C724=\"\",\"\",C724+1))","v":""},null,null,{"$f":"IF(G721=AA728,1,IF(D723=\"\",\"\",D723+1))","v":""},null,null,{"$f":"IF(J721=AA728,1,IF(G723=\"\",\"\",G723+1))","v":""},null,null,{"$f":"IF(M721=AA728,1,IF(J723=\"\",\"\",J723+1))","v":""},null,null,{"$f":"IF(P721=AA728,1,IF(M723=\"\",\"\",M723+1))","v":""},null,null,{"$f":"IF(S721=AA728,1,IF(P723=\"\",\"\",P723+1))","v":1},null,null,{"$f":"IF(V721=AA728,1,IF(S723=\"\",\"\",S723+1))","v":2}]
[null,null,null,null,{"$f":"IF(D723=\"\",\"\",_xlfn._xlws.FILTER(Base!$B:$B,Base!$A:$A=DATE(Calendário!AA726,Calendário!AA725,Calendário!D723),\"\"))","v":""},null,null,{"$f":"IF(G723=\"\",\"\",_xlfn._xlws.FILTER(Base!$B:$B,Base!$A:$A=DATE(Calendário!AA726,Calendário!AA725,Calendário!G723),\"\"))","v":""},null,null,{"$f":"IF(J723=\"\",\"\",_xlfn._xlws.FILTER(Base!$B:$B,Base!$A:$A=DATE(Calendário!AA726,Calendário!AA725,Calendário!J723),\"\"))","v":""},null,null,{"$f":"IF(M723=\"\",\"\",_xlfn._xlws.FILTER(Base!$B:$B,Base!$A:$A=DATE(Calendário!AA726,Calendário!AA725,Calendário!M723),\"\"))","v":""},null,null,{"$f":"IF(P723=\"\",\"\",_xlfn._xlws.FILTER(Base!$B:$B,Base!$A:$A=DATE(Calendário!AA726,Calendário!AA725,Calendário!P723),\"\"))","v":""},null,null,{"$f":"IF(S723=\"\",\"\",_xlfn._xlws.FILTER(Base!$B:$B,Base!$A:$A=DATE(Calendário!AA726,Calendário!AA725,Calendário!S723),\"\"))","v":""},null,null,{"$f":"IF(V723=\"\",\"\",_xlfn._xlws.FILTER(Base!$B:$B,Base!$A:$A=DATE(Calendário!AA726,Calendário!AA725,Calendário!V723),\"\"))","v":""},null,null,"Dia",1]
[null,null,null,null,null,null,null,null,null,null,null,null,null,null,null,null,null,null,null,null,null,null,null,null,null,"Mês",{"$f":"IF((AA660+1)>12,1,AA660+1)","v":11}]
[null,null,null,null,null,null,null,null,null,null,null,null,null,null,null,null,null,null,null,null,null,null,null,null,null,"Ano",{"$f":"IF((AA660+1)>12,AA661+1,AA661)","v":2024}]
[null,null,null,null,null,null,null,null,null,null,null,null,null,null,null,null,null,null,null,null,null,null,null,null,null,"Primeiro dia",{"$f":"DATE(AA726,AA725,1)","v":"2024-11-01"}]
[null,null,null,null,null,null,null,null,null,null,null,null,null,null,null,null,null,null,null,null,null,null,null,null,null,"Dia da Semana",{"$f":"WEEKDAY(AA727)","v":6}]
[null,null,null,null,null,null,null,null,null,null,null,null,null,null,null,null,null,null,null,null,null,null,null,null,null,"Último dia",{"$f":"EOMONTH(AA727,0)","v":"2024-11-30"}]
[null,null,null,{"$f":"V723+1","v":3},null,null,{"$f":"D730+1","v":4},null,null,{"$f":"G730+1","v":5},null,null,{"$f":"J730+1","v":6},null,null,{"$f":"M730+1","v":7},null,null,{"$f":"P730+1","v":8},null,null,{"$f":"S730+1","v":9},null,null,null,"Dia",{"$f":"DAY(AA729)","v":30}]
[null,null,null,null,{"$f":"IF(D730=\"\",\"\",_xlfn._xlws.FILTER(Base!$B:$B,Base!$A:$A=DATE(Calendário!AA726,Calendário!AA725,Calendário!D730),\"\"))","v":""},null,null,{"$f":"IF(G730=\"\",\"\",_xlfn._xlws.FILTER(Base!$B:$B,Base!$A:$A=DATE(Calendário!AA726,Calendário!AA725,Calendário!G730),\"\"))","v":""},null,null,{"$f":"IF(J730=\"\",\"\",_xlfn._xlws.FILTER(Base!$B:$B,Base!$A:$A=DATE(Calendário!AA726,Calendário!AA725,Calendário!J730),\"\"))","v":""},null,null,{"$f":"IF(M730=\"\",\"\",_xlfn._xlws.FILTER(Base!$B:$B,Base!$A:$A=DATE(Calendário!AA726,Calendário!AA725,Calendário!M730),\"\"))","v":""},null,null,{"$f":"IF(P730=\"\",\"\",_xlfn._xlws.FILTER(Base!$B:$B,Base!$A:$A=DATE(Calendário!AA726,Calendário!AA725,Calendário!P730),\"\"))","v":""},null,null,{"$f":"IF(S730=\"\",\"\",_xlfn._xlws.FILTER(Base!$B:$B,Base!$A:$A=DATE(Calendário!AA726,Calendário!AA725,Calendário!S730),\"\"))","v":""},null,null,{"$f":"IF(V730=\"\",\"\",_xlfn._xlws.FILTER(Base!$B:$B,Base!$A:$A=DATE(Calendário!AA726,Calendário!AA725,Calendário!V730),\"\"))","v":""}]
[]
[]
[]
[]
[]
[null,null,null,{"$f":"V730+1","v":10},null,null,{"$f":"D737+1","v":11},null,null,{"$f":"G737+1","v":12},null,null,{"$f":"J737+1","v":13},null,null,{"$f":"M737+1","v":14},null,null,{"$f":"P737+1","v":15},null,null,{"$f":"S737+1","v":16}]
[null,null,null,null,{"$f":"IF(D737=\"\",\"\",_xlfn._xlws.FILTER(Base!$B:$B,Base!$A:$A=DATE(Calendário!AA726,Calendário!AA725,Calendário!D737),\"\"))","v":""},null,null,{"$f":"IF(G737=\"\",\"\",_xlfn._xlws.FILTER(Base!$B:$B,Base!$A:$A=DATE(Calendário!AA726,Calendário!AA725,Calendário!G737),\"\"))","v":""},null,null,{"$f":"IF(J737=\"\",\"\",_xlfn._xlws.FILTER(Base!$B:$B,Base!$A:$A=DATE(Calendário!AA726,Calendário!AA725,Calendário!J737),\"\"))","v":""},null,null,{"$f":"IF(M737=\"\",\"\",_xlfn._xlws.FILTER(Base!$B:$B,Base!$A:$A=DATE(Calendário!AA726,Calendário!AA725,Calendário!M737),\"\"))","v":""},null,null,{"$f":"IF(P737=\"\",\"\",_xlfn._xlws.FILTER(Base!$B:$B,Base!$A:$A=DATE(Calendário!AA726,Calendário!AA725,Calendário!P737),\"\"))","v":""},null,null,{"$f":"IF(S737=\"\",\"\",_xlfn._xlws.FILTER(Base!$B:$B,Base!$A:$A=DATE(Calendário!AA726,Calendário!AA725,Calendário!S737),\"\"))","v":""},null,null,{"$f":"IF(V737=\"\",\"\",_xlfn._xlws.FILTER(Base!$B:$B,Base!$A:$A=DATE(Calendário!AA726,Calendário!AA725,Calendário!V737),\"\"))","v":""}]
[]
[]
[]
[]
[]
[null,null,null,{"$f":"V737+1","v":17},null,null,{"$f":"D744+1","v":18},null,null,{"$f":"G744+1","v":19},null,null,{"$f":"J744+1","v":20},null,null,{"$f":"M744+1","v":21},null,null,{"$f":"P744+1","v":22},null,null,{"$f":"S744+1","v":23}]
[null,null,null,null,{"$f":"IF(D744=\"\",\"\",_xlfn._xlws.FILTER(Base!$B:$B,Base!$A:$A=DATE(Calendário!AA726,Calendário!AA725,Calendário!D744),\"\"))","v":""},null,null,{"$f":"IF(G744=\"\",\"\",_xlfn._xlws.FILTER(Base!$B:$B,Base!$A:$A=DATE(Calendário!AA726,Calendário!AA725,Calendário!G744),\"\"))","v":""},null,null,{"$f":"IF(J744=\"\",\"\",_xlfn._xlws.FILTER(Base!$B:$B,Base!$A:$A=DATE(Calendário!AA726,Calendário!AA725,Calendário!J744),\"\"))","v":""},null,null,{"$f":"IF(M744=\"\",\"\",_xlfn._xlws.FILTER(Base!$B:$B,Base!$A:$A=DATE(Calendário!AA726,Calendário!AA725,Calendário!M744),\"\"))","v":""},null,null,{"$f":"IF(P744=\"\",\"\",_xlfn._xlws.FILTER(Base!$B:$B,Base!$A:$A=DATE(Calendário!AA726,Calendário!AA725,Calendário!P744),\"\"))","v":""},null,null,{"$f":"IF(S744=\"\",\"\",_xlfn._xlws.FILTER(Base!$B:$B,Base!$A:$A=DATE(Calendário!AA726,Calendário!AA725,Calendário!S744),\"\"))","v":""},null,null,{"$f":"IF(V744=\"\",\"\",_xlfn._xlws.FILTER(Base!$B:$B,Base!$A:$A=DATE(Calendário!AA726,Calendário!AA725,Calendário!V744),\"\"))","v":""}]
[]
[]
[]
[]
[]
[null,null,null,{"$f":"IF(V744=\"\",\"\",IF(V744+1>AA730,\"\",V744+1))","v":24},null,null,{"$f":"IF(D751=\"\",\"\",IF(D751+1>AA730,\"\",D751+1))","v":25},null,null,{"$f":"IF(G751=\"\",\"\",IF(G751+1>AA730,\"\",G751+1))","v":26},null,null,{"$f":"IF(J751=\"\",\"\",IF(J751+1>AA730,\"\",J751+1))","v":27},null,null,{"$f":"IF(M751=\"\",\"\",IF(M751+1>AA730,\"\",M751+1))","v":28},null,null,{"$f":"IF(P751=\"\",\"\",IF(P751+1>AA730,\"\",P751+1))","v":29},null,null,{"$f":"IF(S751=\"\",\"\",IF(S751+1>AA730,\"\",S751+1))","v":30}]
[null,null,null,null,{"$f":"IF(D751=\"\",\"\",_xlfn._xlws.FILTER(Base!$B:$B,Base!$A:$A=DATE(Calendário!AA726,Calendário!AA725,Calendário!D751),\"\"))","v":""},null,null,{"$f":"IF(G751=\"\",\"\",_xlfn._xlws.FILTER(Base!$B:$B,Base!$A:$A=DATE(Calendário!AA726,Calendário!AA725,Calendário!G751),\"\"))","v":""},null,null,{"$f":"IF(J751=\"\",\"\",_xlfn._xlws.FILTER(Base!$B:$B,Base!$A:$A=DATE(Calendário!AA726,Calendário!AA725,Calendário!J751),\"\"))","v":""},null,null,{"$f":"IF(M751=\"\",\"\",_xlfn._xlws.FILTER(Base!$B:$B,Base!$A:$A=DATE(Calendário!AA726,Calendário!AA725,Calendário!M751),\"\"))","v":""},null,null,{"$f":"IF(P751=\"\",\"\",_xlfn._xlws.FILTER(Base!$B:$B,Base!$A:$A=DATE(Calendário!AA726,Calendário!AA725,Calendário!P751),\"\"))","v":""},null,null,{"$f":"IF(S751=\"\",\"\",_xlfn._xlws.FILTER(Base!$B:$B,Base!$A:$A=DATE(Calendário!AA726,Calendário!AA725,Calendário!S751),\"\"))","v":""},null,null,{"$f":"IF(V751=\"\",\"\",_xlfn._xlws.FILTER(Base!$B:$B,Base!$A:$A=DATE(Calendário!AA726,Calendário!AA725,Calendário!V751),\"\"))","v":""}]
[]
[]
[]
[]
[]
[null,null,null,{"$f":"IF(V751=\"\",\"\",IF(V751+1>AA730,\"\",V751+1))","v":""},null,null,{"$f":"IF(D758=\"\",\"\",IF(D758+1>AA730,\"\",D758+1))","v":""},null,null,{"$f":"IF(G758=\"\",\"\",IF(G758+1>AA730,\"\",G758+1))","v":""},null,null,{"$f":"IF(J758=\"\",\"\",IF(J758+1>AA730,\"\",J758+1))","v":""},null,null,{"$f":"IF(M758=\"\",\"\",IF(M758+1>AA730,\"\",M758+1))","v":""},null,null,{"$f":"IF(P758=\"\",\"\",IF(P758+1>AA730,\"\",P758+1))","v":""},null,null,{"$f":"IF(S758=\"\",\"\",IF(S758+1>AA730,\"\",S758+1))","v":""}]
[null,null,null,null,{"$f":"IF(D758=\"\",\"\",_xlfn._xlws.FILTER(Base!$B:$B,Base!$A:$A=DATE(Calendário!AA726,Calendário!AA725,Calendário!D758),\"\"))","v":""},null,null,{"$f":"IF(G758=\"\",\"\",_xlfn._xlws.FILTER(Base!$B:$B,Base!$A:$A=DATE(Calendário!AA726,Calendário!AA725,Calendário!G758),\"\"))","v":""},null,null,{"$f":"IF(J758=\"\",\"\",_xlfn._xlws.FILTER(Base!$B:$B,Base!$A:$A=DATE(Calendário!AA726,Calendário!AA725,Calendário!J758),\"\"))","v":""},null,null,{"$f":"IF(M758=\"\",\"\",_xlfn._xlws.FILTER(Base!$B:$B,Base!$A:$A=DATE(Calendário!AA726,Calendário!AA725,Calendário!M758),\"\"))","v":""},null,null,{"$f":"IF(P758=\"\",\"\",_xlfn._xlws.FILTER(Base!$B:$B,Base!$A:$A=DATE(Calendário!AA726,Calendário!AA725,Calendário!P758),\"\"))","v":""},null,null,{"$f":"IF(S758=\"\",\"\",_xlfn._xlws.FILTER(Base!$B:$B,Base!$A:$A=DATE(Calendário!AA726,Calendário!AA725,Calendário!S758),\"\"))","v":""},null,null,{"$f":"IF(V758=\"\",\"\",_xlfn._xlws.FILTER(Base!$B:$B,Base!$A:$A=DATE(Calendário!AA726,Calendário!AA725,Calendário!V758),\"\"))","v":""}]
[]
[]
[]
[]
[]
[]
[]
[null,null,null,"Anotações"]

{"sheet":"Base","index":2,"n_rows":294,"n_cols":21,"rows_kept":294,"cut":false,"hidden":true,"merged":[]}
[null,null,null,null,null,null,null,null,null,null,null,null,{"$f":"COUNT((M5:M10))","v":0}]
[null,null,null,null,null,null,null,null,null,null,{"$f":"AND(EXACT(L2:O2,L2))","v":true},{"$f":"COUNTA(L5:L10)","v":0},{"$f":"COUNTA(M5:M10)","v":0},{"$f":"COUNTA(N5:N10)","v":0},{"$f":"COUNTA(O5:O10)","v":0}]
["LEMBRETES",null,null,{"$f":"IFERROR(_xlfn.XLOOKUP(C3,Início!$C$20:$C$25,Início!$I$20:$I$25,\"\"),\"\")","v":""},{"$f":"_xlfn.XLOOKUP(C3,$R$5:$R$10,$K$5:$K$10,C3,0)","v":0},null,null,null,null,null,null,null,null,null,null,{"$f":"M1+Início!F12","v":3},null,null,null,"MESES"]
["Dia","Lembrete","ID","Status","Novo ID",null,null,"IDF","FREQUÊNCIA",null,"ID","Medicamento","Data","Hora","Qtde dias","H+M","Status","Old ID",null,"NMÊS","MÊS"]
["2023-07-01","06:00 | Caixinha",0,null,null,null,null,1,"1x ao dia",1,1,null,null,null,null,{"$f":"TEXT(N5,\"hh:mm\")&\" | \"&L5","v":"00:00 | "},{"$f":"_xlfn.XLOOKUP(K5,Início!$C$20:$C$25,Início!$I$20:$I$25,\"\")","v":0},1,null,1,"JANEIRO"]
["2023-07-02","06:00 | Caixinha",0,null,null,null,null,2,"12h/12h",2,2,null,null,null,null,{"$f":"TEXT(N6,\"hh:mm\")&\" | \"&L6","v":"00:00 | "},{"$f":"_xlfn.XLOOKUP(K6,Início!$C$20:$C$25,Início!$I$20:$I$25,\"\")","v":0},2,null,2,"FEVEREIRO"]
["2023-07-03","06:00 | Caixinha",0,null,null,null,null,3,null,3,3,null,null,null,null,"00:00 | ",{"$f":"_xlfn.XLOOKUP(K7,Início!$C$20:$C$25,Início!$I$20:$I$25,\"\")","v":0},3,null,3,"MARÇO"]
["2023-07-04","06:00 | Caixinha",0,null,null,null,null,null,null,4,4,null,null,null,null,"00:00 | ",{"$f":"_xlfn.XLOOKUP(K8,Início!$C$20:$C$25,Início!$I$20:$I$25,\"\")","v":0},4,null,4,"ABRIL"]
["2023-07-05","06:00 | Caixinha",0,null,null,null,null,null,null,5,5,null,null,null,null,"00:00 | ",{"$f":"_xlfn.XLOOKUP(K9,Início!$C$20:$C$25,Início!$I$20:$I$25,\"\")","v":0},5,null,5,"MAIO"]
["2023-07-06","06:00 | Caixinha",0,null,null,null,null,null,null,6,6,null,null,null,null,"00:00 | ",{"$f":"_xlfn.XLOOKUP(K10,Início!$C$20:$C$25,Início!$I$20:$I$25,\"\")","v":0},6,null,6,"JUNHO"]
["2023-07-07","06:00 | Caixinha",0,null,null,null,null,null,null,null,null,null,null,null,null,null,null,null,null,7,"JULHO"]
["2023-07-08","06:00 | Caixinha",0,null,null,null,null,null,null,null,null,null,null,null,null,null,null,null,null,8,"AGOSTO"]
["2023-07-09","06:00 | Caixinha",0,null,null,null,null,null,null,null,null,null,null,null,null,null,null,null,null,9,"SETEMBRO"]
["2023-07-10","06:00 | Caixinha",0,null,null,null,null,null,null,null,null,null,null,null,null,null,null,null,null,10,"OUTUBRO"]
["2023-07-11","06:00 | Caixinha",0,null,null,null,null,null,null,null,null,null,null,null,null,null,null,null,null,11,"NOVEMBRO"]
["2023-07-12","06:00 | Caixinha",0,null,null,null,null,null,null,null,null,null,null,null,null,null,null,null,null,12,"DEZEMBRO"]
["2023-07-13","06:00 | Caixinha",0]
["2023-07-14","06:00 | Caixinha",0]
["2023-07-15","06:00 | Caixinha",0]
["2023-07-16","06:00 | Caixinha",0]
["2023-07-17","06:00 | Caixinha",0]
["2023-07-18","06:00 | Caixinha",0]
["2023-07-19","06:00 | Caixinha",0]
["2023-07-20","06:00 | Caixinha",0]
["2023-07-21","06:00 | Caixinha",0]
["2023-07-22","06:00 | Caixinha",0]
["2023-07-23","06:00 | Caixinha",0]
["2023-07-24","06:00 | Caixinha",0]
["2023-07-25","06:00 | Caixinha",0]
["2023-07-26","06:00 | Caixinha",0]
["2023-07-27","06:00 | Caixinha",0]
["2023-07-28","06:00 | Caixinha",0]
["2023-07-29","06:00 | Caixinha",0]
["2023-07-30","06:00 | Caixinha",0]
["2023-07-31","06:00 | Caixinha",0]
["2023-08-01","06:00 | Caixinha",0]
["2023-08-02","06:00 | Caixinha",0]
["2023-08-03","06:00 | Caixinha",0]
["2023-08-04","06:00 | Caixinha",0]
["2023-08-05","06:00 | Caixinha",0]
["2023-08-06","06:00 | Caixinha",0]
["2023-08-07","06:00 | Caixinha",0]
["2023-08-08","06:00 | Caixinha",0]
["2023-08-09","06:00 | Caixinha",0]
["2023-08-10","06:00 | Caixinha",0]
["2023-08-11","06:00 | Caixinha",0]
["2023-08-12","06:00 | Caixinha",0]
["2023-08-13","06:00 | Caixinha",0]
["2023-08-14","06:00 | Caixinha",0]
["2023-08-15","06:00 | Caixinha",0]
["2023-08-16","06:00 | Caixinha",0]
["2023-08-17","06:00 | Caixinha",0]
["2023-08-18","06:00 | Caixinha",0]
["2023-08-19","06:00 | Caixinha",0]
["2023-08-20","06:00 | Caixinha",0]
["2023-08-21","06:00 | Caixinha",0]
["2023-08-22","06:00 | Caixinha",0]
["2023-08-23","06:00 | Caixinha",0]
["2023-08-24","06:00 | Caixinha",0]
["2023-08-25","06:00 | Caixinha",0]
["2023-08-26","06:00 | Caixinha",0]
["2023-08-27","06:00 | Caixinha",0]
["2023-08-28","06:00 | Caixinha",0]
["2023-08-29","06:00 | Caixinha",0]
["2023-11-09","19:00 | Puran",0]
["2023-11-10","19:00 | Puran",0]
["2023-11-11","19:00 | Puran",0]
["2023-11-12","19:00 | Puran",0]
["2023-11-13","19:00 | Puran",0]
["2023-11-14","19:00 | Puran",0]
["2023-11-15","19:00 | Puran",0]
["2023-11-16","19:00 | Puran",0]
["2023-11-17","19:00 | Puran",0]
["2023-11-18","19:00 | Puran",0]
["2023-11-19","19:00 | Puran",0]
["2023-11-20","19:00 | Puran",0]
["2023-11-21","19:00 | Puran",0]
["2023-11-22","19:00 | Puran",0]
["2023-11-23","19:00 | Puran",0]
["2023-11-24","19:00 | Puran",0]
["2023-11-25","19:00 | Puran",0]
["2023-11-26","19:00 | Puran",0]
["2023-11-27","19:00 | Puran",0]
["2023-11-28","19:00 | Puran",0]
["2023-11-29","19:00 | Puran",0]
["2023-11-30","19:00 | Puran",0]
["2023-12-01","19:00 | Puran",0]
["2023-12-02","19:00 | Puran",0]
["2023-12-03","19:00 | Puran",0]
["2023-12-04","19:00 | Puran",0]
["2023-12-05","19:00 | Puran",0]
["2023-12-06","19:00 | Puran",0]
["2023-12-07","19:00 | Puran",0]
["2023-12-08","19:00 | Puran",0]
["2023-12-09","19:00 | Puran",0]
["2023-12-10","19:00 | Puran",0]
["2023-12-11","19:00 | Puran",0]
["2023-12-12","19:00 | Puran",0]
["2023-12-13","19:00 | Puran",0]
["2023-12-14","19:00 | Puran",0]
["2023-12-15","19:00 | Puran",0]
["2023-12-16","19:00 | Puran",0]
["2023-12-17","19:00 | Puran",0]
["2023-12-18","19:00 | Puran",0]
["2023-12-19","19:00 | Puran",0]
["2023-12-20","19:00 | Puran",0]
["2023-12-21","19:00 | Puran",0]
["2023-12-22","19:00 | Puran",0]
["2023-12-23","19:00 | Puran",0]
["2023-12-24","19:00 | Puran",0]
["2023-12-25","19:00 | Puran",0]
["2023-12-26","19:00 | Puran",0]
["2023-12-27","19:00 | Puran",0]
["2023-12-28","19:00 | Puran",0]
["2023-06-01","09:00 | Clex",0]
["2023-06-02","09:00 | Clex",0]
["2023-06-03","09:00 | Clex",0]
["2023-06-04","09:00 | Clex",0]
["2023-06-05","09:00 | Clex",0]
["2023-06-06","09:00 | Clex",0]
["2023-06-07","09:00 | Clex",0]
["2023-06-08","09:00 | Clex",0]
["2023-06-09","09:00 | Clex",0]
["2023-06-10","09:00 | Clex",0]
["2023-06-11","09:00 | Clex",0]
["2023-06-12","09:00 | Clex",0]
["2023-06-13","09:00 | Clex",0]
["2023-06-14","09:00 | Clex",0]
["2023-06-15","09:00 | Clex",0]
["2023-06-16","09:00 | Clex",0]
["2023-06-17","09:00 | Clex",0]
["2023-06-18","09:00 | Clex",0]
["2023-06-19","09:00 | Clex",0]
["2023-06-20","09:00 | Clex",0]
["2023-06-21","09:00 | Clex",0]
["2023-06-22","09:00 | Clex",0]
["2023-06-23","09:00 | Clex",0]
["2023-06-24","09:00 | Clex",0]
["2023-06-25","09:00 | Clex",0]
["2023-06-26","09:00 | Clex",0]
["2023-06-27","09:00 | Clex",0]
["2023-06-28","09:00 | Clex",0]
["2023-06-29","09:00 | Clex",0]
["2023-06-30","09:00 | Clex",0]
["2023-07-01","09:00 | Clex",0]
["2023-07-02","09:00 | Clex",0]
["2023-07-03","09:00 | Clex",0]
["2023-07-04","09:00 | Clex",0]
["2023-07-05","09:00 | Clex",0]
["2023-07-06","09:00 | Clex",0]
["2023-07-07","09:00 | Clex",0]
["2023-07-08","09:00 | Clex",0]
["2023-07-09","09:00 | Clex",0]
["2023-07-10","09:00 | Clex",0]
["2023-07-11","09:00 | Clex",0]
["2023-07-12","09:00 | Clex",0]
["2023-07-13","09:00 | Clex",0]
["2023-07-14","09:00 | Clex",0]
["2023-07-15","09:00 | Clex",0]
["2023-07-16","09:00 | Clex",0]
["2023-07-17","09:00 | Clex",0]
["2023-07-18","09:00 | Clex",0]
["2023-07-19","09:00 | Clex",0]
["2023-07-20","09:00 | Clex",0]
["2023-07-21","09:00 | Clex",0]
["2023-07-22","09:00 | Clex",0]
["2023-07-23","09:00 | Clex",0]
["2023-07-24","09:00 | Clex",0]
["2023-07-25","09:00 | Clex",0]
["2023-07-26","09:00 | Clex",0]
["2023-07-27","09:00 | Clex",0]
["2023-07-28","09:00 | Clex",0]
["2023-07-29","09:00 | Clex",0]
["2023-07-30","09:00 | Clex",0]
["2023-07-31","09:00 | Clex",0]
["2023-08-01","09:00 | Clex",0]
["2023-08-02","09:00 | Clex",0]
["2023-08-03","09:00 | Clex",0]
["2023-08-04","09:00 | Clex",0]
["2023-08-05","09:00 | Clex",0]
["2023-08-06","09:00 | Clex",0]
["2023-08-07","09:00 | Clex",0]
["2023-08-08","09:00 | Clex",0]
["2023-08-09","09:00 | Clex",0]
["2023-08-10","09:00 | Clex",0]
["2023-08-11","09:00 | Clex",0]
["2023-08-12","09:00 | Clex",0]
["2023-08-13","09:00 | Clex",0]
["2023-08-14","09:00 | Clex",0]
["2023-08-15","09:00 | Clex",0]
["2023-08-16","09:00 | Clex",0]
["2023-08-17","09:00 | Clex",0]
["2023-08-18","09:00 | Clex",0]
["2023-08-19","09:00 | Clex",0]
["2023-08-20","09:00 | Clex",0]
["2023-08-21","09:00 | Clex",0]
["2023-08-22","09:00 | Clex",0]
["2023-08-23","09:00 | Clex",0]
["2023-08-24","09:00 | Clex",0]
["2023-08-25","09:00 | Clex",0]
["2023-08-26","09:00 | Clex",0]
["2023-08-27","09:00 | Clex",0]
["2023-08-28","09:00 | Clex",0]
["2023-08-29","09:00 | Clex",0]
["2023-06-01","21:00 | Clex",0]
["2023-06-02","21:00 | Clex",0]
["2023-06-03","21:00 | Clex",0]
["2023-06-04","21:00 | Clex",0]
["2023-06-05","21:00 | Clex",0]
["2023-06-06","21:00 | Clex",0]
["2023-06-07","21:00 | Clex",0]
["2023-06-08","21:00 | Clex",0]
["2023-06-09","21:00 | Clex",0]
["2023-06-10","21:00 | Clex",0]
["2023-06-11","21:00 | Clex",0]
["2023-06-12","21:00 | Clex",0]
["2023-06-13","21:00 | Clex",0]
["2023-06-14","21:00 | Clex",0]
["2023-06-15","21:00 | Clex",0]
["2023-06-16","21:00 | Clex",0]
["2023-06-17","21:00 | Clex",0]
["2023-06-18","21:00 | Clex",0]
["2023-06-19","21:00 | Clex",0]
["2023-06-20","21:00 | Clex",0]
["2023-06-21","21:00 | Clex",0]
["2023-06-22","21:00 | Clex",0]
["2023-06-23","21:00 | Clex",0]
["2023-06-24","21:00 | Clex",0]
["2023-06-25","21:00 | Clex",0]
["2023-06-26","21:00 | Clex",0]
["2023-06-27","21:00 | Clex",0]
["2023-06-28","21:00 | Clex",0]
["2023-06-29","21:00 | Clex",0]
["2023-06-30","21:00 | Clex",0]
["2023-07-01","21:00 | Clex",0]
["2023-07-02","21:00 | Clex",0]
["2023-07-03","21:00 | Clex",0]
["2023-07-04","21:00 | Clex",0]
["2023-07-05","21:00 | Clex",0]
["2023-07-06","21:00 | Clex",0]
["2023-07-07","21:00 | Clex",0]
["2023-07-08","21:00 | Clex",0]
["2023-07-09","21:00 | Clex",0]
["2023-07-10","21:00 | Clex",0]
["2023-07-11","21:00 | Clex",0]
["2023-07-12","21:00 | Clex",0]
["2023-07-13","21:00 | Clex",0]
["2023-07-14","21:00 | Clex",0]
["2023-07-15","21:00 | Clex",0]
["2023-07-16","21:00 | Clex",0]
["2023-07-17","21:00 | Clex",0]
["2023-07-18","21:00 | Clex",0]
["2023-07-19","21:00 | Clex",0]
["2023-07-20","21:00 | Clex",0]
["2023-07-21","21:00 | Clex",0]
["2023-07-22","21:00 | Clex",0]
["2023-07-23","21:00 | Clex",0]
["2023-07-24","21:00 | Clex",0]
["2023-07-25","21:00 | Clex",0]
["2023-07-26","21:00 | Clex",0]
["2023-07-27","21:00 | Clex",0]
["2023-07-28","21:00 | Clex",0]
["2023-07-29","21:00 | Clex",0]
["2023-07-30","21:00 | Clex",0]
["2023-07-31","21:00 | Clex",0]
["2023-08-01","21:00 | Clex",0]
["2023-08-02","21:00 | Clex",0]
["2023-08-03","21:00 | Clex",0]
["2023-08-04","21:00 | Clex",0]
["2023-08-05","21:00 | Clex",0]
["2023-08-06","21:00 | Clex",0]
["2023-08-07","21:00 | Clex",0]
["2023-08-08","21:00 | Clex",0]
["2023-08-09","21:00 | Clex",0]
["2023-08-10","21:00 | Clex",0]
["2023-08-11","21:00 | Clex",0]
["2023-08-12","21:00 | Clex",0]
["2023-08-13","21:00 | Clex",0]
["2023-08-14","21:00 | Clex",0]
["2023-08-15","21:00 | Clex",0]
["2023-08-16","21:00 | Clex",0]
["2023-08-17","21:00 | Clex",0]
["2023-08-18","21:00 | Clex",0]
["2023-08-19","21:00 | Clex",0]
["2023-08-20","21:00 | Clex",0]
["2023-08-21","21:00 | Clex",0]
["2023-08-22","21:00 | Clex",0]
["2023-08-23","21:00 | Clex",0]
["2023-08-24","21:00 | Clex",0]
["2023-08-25","21:00 | Clex",0]
["2023-08-26","21:00 | Clex",0]
["2023-08-27","21:00 | Clex",0]
["2023-08-28","21:00 | Clex",0]
["2023-08-29","21:00 | Clex",0]