{"text_format":"1","workbook":"xlsx","n_sheets":3,"sheets":["Início","Calendário","Base"],"not_rendered":{"charts":0,"images":17,"macros":1,"external_links":0,"defined_names":4,"comments":1,"pivot_tables":0},"unopened":[],"bounds":{"document_bytes":16777216,"sheet_cells":100000,"rows_first":2000,"rows_last":500,"rows_between":2000,"halvings":0,"cell_chars":16384,"cell_head_chars":4096},"cells_cut":0,"cells_raw":0,"read":"whole","date_system":"1900"}

{"sheet":"Início","index":0,"n_rows":25,"n_cols":9,"rows_kept":25,"cut":false,"hidden":false,"merged":[]}
[]
[]
[]
[]
[]
[null,null,null,"Medicamento:"]
[]
[null,null,null,"Data de início:"]
[]
[null,null,null,"Hora do lembrete:",null,{"$f":"IF(F12=2,E10+G10,E10)","v":"00:00:00"},"12:00:00"]
[]
[null,null,null,"Frequência:",null,{"$f":"_xlfn.XLOOKUP(E12,Base!$I$5:$I$7,Base!$H$5:$H$7,\"\",0,1)","v":3}]
[]
[null,null,null,"Por quantos dias:"]
[null,null,null,null,{"$f":"COUNTA(E6,E8,E10,E12,E14)","v":0}]
[]
[]
[null,null,null,null,null,null,null,null,{"$f":"COUNTIF(I20:I25,\"Excluir\")","v":0}]
[null,null,"Lembrete","Medicamento","Data Início","Hora","Qtde dias","Status"]
[null,null,1,null,null,null,null,{"$f":"IF(I20=\"\",\"\",IF(I20=\"Salvo\",3,2))","v":""}]
[null,null,2,null,null,null,null,{"$f":"IF(I21=\"\",\"\",IF(I21=\"Salvo\",3,2))","v":""}]
[null,null,3,null,null,null,null,""]
[null,null,4,null,null,null,null,""]
[null,null,5,null,null,null,null,""]
[null,null,6,null,null,null,null,""]

{"sheet":"Calendário","index":1,"n_rows":767,"n_cols":42,"rows_kept":767,"cut":false,"hidden":false,"merged":[]}
[]
[]
[]
[]
[null,null,null,{"$f":"_xlfn.XLOOKUP($AA$10,Base!$T$5:$T$16,Base!$U$5:$U$16,\"\",0,1)&\"|\"&$AA$11","v":"DEZEMBRO|2023"},null,null,null,null,null,null,null,null,null,null,null,null,null,null,null,null,null,null,null,null,null,null,{"$f":"SMALL(Início!E20:'Início'!E25,1)","v":{"$error":"#NUM!"}}]
[null,null,null,1,null,null,2,null,null,3,null,null,4,null,null,5,null,null,6,null,null,7]
[null,null,null,"Domingo",null,null,"Segunda-feira",null,null,"Terça-feira",null,null,"Quarta-feira",null,null,"Quinta-feira",null,null,"Sexta-feira",null,null,"Sábado",null,null,null,"Data",{"$f":"IF(Início!$E$20=\"\",TODAY(),SMALL(Início!E20:'Início'!E25,1))","v":"2023-12-05"},null,"Data",{"$f":"IF(Início!$E$21=\"\",\"\",SMALL(Início!E20:'Início'!E25,2))","v":""},null,"Data",{"$f":"IF(Início!$E$22=\"\",\"\",SMALL(Início!E20:'Início'!E25,3))","v":""},null,"Data",{"$f":"IF(Início!$E$23=\"\",\"\",SMALL(Início!E20:'Início'!E25,4))","v":""},null,"Data",{"$f":"IF(Início!$E$24=\"\",\"\",SMALL(Início!E20:'Início'!E25,5))","v":""},null,"Data",{"$f":"IF(Início!$E$25=\"\",\"\",SMALL(Início!E20:'Início'!E25,6))","v":""}]
[null,null,null,{"$f":"IF(D6=$AA$13,1,IF(C9=\"\",\"\",C9+1))","v":""},{"$f":"IFERROR(IF(D8=$AA$9,\"Início do tratamento!\",IF(D8=$AD$9,\"Início do tratamento!\",IF(D8=$AG$9,\"Início do tratamento!\",IF(D8=$AJ$9,\"Início do tratamento!\",IF(D8=$AM$9,\"Início do tratamento!\",\"\"))))),\"\")","v":""},null,{"$f":"IF(G6=$AA$13,1,IF(D8=\"\",\"\",D8+1))","v":""},{"$f":"IFERROR(IF(G8=$AA$9,\"Início do tratamento!\",IF(G8=$AD$9,\"Início do tratamento!\",IF(G8=$AG$9,\"Início do tratamento!\",IF(G8=$AJ$9,\"Início do tratamento!\",IF(G8=$AM$9,\"Início do tratamento!\",\"\"))))),\"\")","v":""},null,{"$f":"IF(J6=$AA$13,1,IF(G8=\"\",\"\",G8+1))","v":""},{"$f":"IFERROR(IF(J8=$AA$9,\"Início do tratamento!\",IF(J8=$AD$9,\"Início do tratamento!\",IF(J8=$AG$9,\"Início do tratamento!\",IF(J8=$AJ$9,\"Início do tratamento!\",IF(J8=$AM$9,\"Início do tratamento!\",\"\"))))),\"\")","v":""},null,{"$f":"IF(M6=$AA$13,1,IF(J8=\"\",\"\",J8+1))","v":""},{"$f":"IFERROR(IF(M8=$AA$9,\"Início do tratamento!\",IF(M8=$AD$9,\"Início do tratamento!\",IF(M8=$AG$9,\"Início do tratamento!\",IF(M8=$AJ$9,\"Início do tratamento!\",IF(M8=$AM$9,\"Início do tratamento!\",\"\"))))),\"\")","v":""},null,{"$f":"IF(P6=$AA$13,1,IF(M8=\"\",\"\",M8+1))","v":""},{"$f":"IFERROR(IF(P8=$AA$9,\"Início do tratamento!\",IF(P8=$AD$9,\"Início do tratamento!\",IF(P8=$AG$9,\"Início do tratamento!\",IF(P8=$AJ$9,\"Início do tratamento!\",IF(P8=$AM$9,\"Início do tratamento!\",\"\"))))),\"\")","v":""},null,{"$f":"IF(S6=$AA$13,1,IF(P8=\"\",\"\",P8+1))","v":1},{"$f":"IFERROR(IF(S8=$AA$9,\"Início do tratamento!\",IF(S8=$AD$9,\"Início do tratamento!\",IF(S8=$AG$9,\"Início do tratamento!\",IF(S8=$AJ$9,\"Início do tratamento!\",IF(S8=$AM$9,\"Início do tratamento!\",\"\"))))),\"\")","v":""},null,{"$f":"IF(V6=$AA$13,1,IF(S8=\"\",\"\",S8+1))","v":2},{"$f":"IFERROR(IF(V8=$AA$9,\"Início do tratamento!\",IF(V8=$AD$9,\"Início do tratamento!\",IF(V8=$AG$9,\"Início do tratamento!\",IF(V8=$AJ$9,\"Início do tratamento!\",IF(V8=$AM$9,\"Início do tratamento!\",\"\"))))),\"\")","v":""}]
[null,null,null,null,{"$f":"IF(D8=\"\",\"\",_xlfn._xlws.FILTER(Base!$B:$B,Base!$A:$A=DATE(Calendário!$AA$11,Calendário!$AA$10,Calendário!D8),\"\"))","v":""},null,null,{"$f":"IF(G8=\"\",\"\",_xlfn._xlws.FILTER(Base!$B:$B,Base!$A:$A=DATE(Calendário!$AA$11,Calendário!$AA$10,Calendário!G8),\"\"))","v":""},null,null,{"$f":"IF(J8=\"\",\"\",_xlfn._xlws.FILTER(Base!$B:$B,Base!$A:$A=DATE(Calendário!$AA$11,Calendário!$AA$10,Calendário!J8),\"\"))","v":""},null,null,{"$f":"IF(M8=\"\",\"\",_xlfn._xlws.FILTER(Base!$B:$B,Base!$A:$A=DATE(Calendário!$AA$11,Calendário!$AA$10,Calendário!M8),\"\"))","v":""},null,null,{"$f":"IF(P8=\"\",\"\",_xlfn._xlws.FILTER(Base!$B:$B,Base!$A:$A=DATE(Calendário!$AA$11,Calendário!$AA$10,Calendário!P8),\"\"))","v":""},null,null,{"$f":"IF(S8=\"\",\"\",_xlfn._xlws.FILTER(Base!$B:$B,Base!$A:$A=DATE(Calendário!$AA$11,Calendário!$AA$10,Calendário!S8),\"\"))","v":"19:00 | Puran"},null,null,{"$f":"IF(V8=\"\",\"\",_xlfn._xlws.FILTER(Base!$B:$B,Base!$A:$A=DATE(Calendário!$AA$11,Calendário!$AA$10,Calendário!V8),\"\"))","v":"19:00 | Puran"},null,null,"Dia",{"$f":"DAY(AA7)","v":5},null,"Dia",{"$f":"DAY(AD7)","v":{"$error":"#VALUE!"}},null,"Dia",{"$f":"DAY(AG7)","v":{"$error":"#VALUE!"}},null,"Dia",{"$f":"DAY(AJ7)","v":{"$error":"#VALUE!"}},null,"Dia",{"$f":"DAY(AM7)","v":{"$error":"#VALUE!"}},null,"Dia",{"$f":"DAY(AP7)","v":{"$error":"#VALUE!"}}]
[null,null,null,null,null,null,null,null,null,null,null,null,null,null,null,null,null,null,null,null,null,null,null,null,null,"Mês",{"$f":"MONTH(AA7)","v":12},null,"Mês",{"$f":"MONTH(AD7)","v":{"$error":"#VALUE!"}},null,"Mês",{"$f":"MONTH(AG7)","v":{"$error":"#VALUE!"}},null,"Mês",{"$f":"MONTH(AJ7)","v":{"$error":"#VALUE!"}},null,"Mês",{"$f":"MONTH(AM7)","v":{"$error":"#VALUE!"}},null,"Mês",{"$f":"MONTH(AP7)","v":{"$error":"#VALUE!"}}]
[null,null,null,null,null,null,null,null,null,null,null,null,null,null,null,null,null,null,null,null,null,null,null,null,null,"Ano",{"$f":"YEAR(AA7)","v":2023},null,"Ano",{"$f":"YEAR(AD7)","v":{"$error":"#VALUE!"}},null,"Ano",{"$f":"YEAR(AG7)","v":{"$error":"#VALUE!"}},null,"Ano",{"$f":"YEAR(AJ7)","v":{"$error":"#VALUE!"}},null,"Ano",{"$f":"YEAR(AM7)","v":{"$error":"#VALUE!"}},null,"Ano",{"$f":"YEAR(AP7)","v":{"$error":"#VALUE!"}}]
[null,null,null,null,null,null,null,null,null,null,null,null,null,null,null,null,null,null,null,null,null,null,null,null,null,"Primeiro dia",{"$f":"DATE(AA11,AA10,1)","v":"2023-12-01"},null,"Primeiro dia",{"$f":"DATE(AD11,AD10,1)","v":{"$error":"#VALUE!"}},null,"Primeiro dia",{"$f":"DATE(AG11,AG10,1)","v":{"$error":"#VALUE!"}},null,"Primeiro dia",{"$f":"DATE(AJ11,AJ10,1)","v":{"$error":"#VALUE!"}},null,"Primeiro dia",{"$f":"DATE(AM11,AM10,1)","v":{"$error":"#VALUE!"}},null,"Primeiro dia",{"$f":"DATE(AP11,AP10,1)","v":{"$error":"#VALUE!"}}]
[null,null,null,null,null,null,null,null,null,null,null,null,null,null,null,null,null,null,null,null,null,null,null,null,null,"Dia da Semana",{"$f":"WEEKDAY(AA12)","v":6},null,"Dia da Semana",{"$f":"WEEKDAY(AD12)","v":{"$error":"#VALUE!"}},null,"Dia da Semana",{"$f":"WEEKDAY(AG12)","v":{"$error":"#VALUE!"}},null,"Dia da Semana",{"$f":"WEEKDAY(AJ12)","v":{"$error":"#VALUE!"}},null,"Dia da Semana",{"$f":"WEEKDAY(AM12)","v":{"$error":"#VALUE!"}},null,"Dia da Semana",{"$f":"WEEKDAY(AP12)","v":{"$error":"#VALUE!"}}]
[null,null,null,null,null,null,null,null,null,null,null,null,null,null,null,null,null,null,null,null,null,null,null,null,null,"Último dia",{"$f":"EOMONTH(AA7,0)","v":"2023-12-31"},null,"Último dia",{"$f":"EOMONTH(AD7,0)","v":{"$error":"#VALUE!"}},null,"Último dia",{"$f":"EOMONTH(AG7,0)","v":{"$error":"#VALUE!"}},null,"Último dia",{"$f":"EOMONTH(AJ7,0)","v":{"$error":"#VALUE!"}},null,"Último dia",{"$f":"EOMONTH(AM7,0)","v":{"$error":"#VALUE!"}},null,"Último dia",{"$f":"EOMONTH(AP7,0)","v":{"$error":"#VALUE!"}}]
[null,null,null,{"$f":"V8+1","v":3},{"$f":"IFERROR(IF(D15=$AA$9,\"Início do tratamento!\",IF(D15=$AD$9,\"Início do tratamento!\",IF(D15=$AG$9,\"Início do tratamento!\",IF(D15=$AJ$9,\"Início do tratamento!\",IF(D15=$AM$9,\"Início do tratamento!\",\"\"))))),\"\")","v":""},null,{"$f":"D15+1","v":4},{"$f":"IFERROR(IF(G15=$AA$9,\"Início do tratamento!\",IF(G15=$AD$9,\"Início do tratamento!\",IF(G15=$AG$9,\"Início do tratamento!\",IF(G15=$AJ$9,\"Início do tratamento!\",IF(G15=$AM$9,\"Início do tratamento!\",\"\"))))),\"\")","v":""},null,{"$f":"G15+1","v":5},{"$f":"IFERROR(IF(J15=$AA$9,\"Início do tratamento!\",IF(J15=$AD$9,\"Início do tratamento!\",IF(J15=$AG$9,\"Início do tratamento!\",IF(J15=$AJ$9,\"Início do tratamento!\",IF(J15=$AM$9,\"Início do tratamento!\",\"\"))))),\"\")","v":"Início do tratamento!"},null,{"$f":"J15+1","v":6},{"$f":"IFERROR(IF(M15=$AA$9,\"Início do tratamento!\",IF(M15=$AD$9,\"Início do tratamento!\",IF(M15=$AG$9,\"Início do tratamento!\",IF(M15=$AJ$9,\"Início do tratamento!\",IF(M15=$AM$9,\"Início do tratamento!\",\"\"))))),\"\")","v":""},null,{"$f":"M15+1","v":7},{"$f":"IFERROR(IF(P15=$AA$9,\"Início do tratamento!\",IF(P15=$AD$9,\"Início do tratamento!\",IF(P15=$AG$9,\"Início do tratamento!\",IF(P15=$AJ$9,\"Início do tratamento!\",IF(P15=$AM$9,\"Início do tratamento!\",\"\"))))),\"\")","v":""},null,{"$f":"P15+1","v":8},{"$f":"IFERROR(IF(S15=$AA$9,\"Início do tratamento!\",IF(S15=$AD$9,\"Início do tratamento!\",IF(S15=$AG$9,\"Início do tratamento!\",IF(S15=$AJ$9,\"Início do tratamento!\",IF(S15=$AM$9,\"Início do tratamento!\",\"\"))))),\"\")","v":""},null,{"$f":"S15+1","v":9},{"$f":"IFERROR(IF(V15=$AA$9,\"Início do tratamento!\",IF(V15=$AD$9,\"Início do tratamento!\",IF(V15=$AG$9,\"Início do tratamento!\",IF(V15=$AJ$9,\"Início do tratamento!\",IF(V15=$AM$9,\"Início do tratamento!\",\"\"))))),\"\")","v":""},null,null,"Dia",{"$f":"DAY(AA14)","v":31},null,"Dia",{"$f":"DAY(AD14)","v":{"$error":"#VALUE!"}},null,"Dia",{"$f":"DAY(AG14)","v":{"$error":"#VALUE!"}},null,"Dia",{"$f":"DAY(AJ14)","v":{"$error":"#VALUE!"}},null,"Dia",{"$f":"DAY(AM14)","v":{"$error":"#VALUE!"}},null,"Dia",{"$f":"DAY(AP14)","v":{"$error":"#VALUE!"}}]
[null,null,null,null,{"$f":"IF(D15=\"\",\"\",_xlfn._xlws.FILTER(Base!$B:$B,Base!$A:$A=DATE(Calendário!$AA$11,Calendário!$AA$10,Calendário!D15),\"\"))","v":"19:00 | Puran"},null,null,{"$f":"IF(G15=\"\",\"\",_xlfn._xlws.FILTER(Base!$B:$B,Base!$A:$A=DATE(Calendário!$AA$11,Calendário!$AA$10,Calendário!G15),\"\"))","v":"19:00 | Puran"},null,null,{"$f":"IF(J15=\"\",\"\",_xlfn._xlws.FILTER(Base!$B:$B,Base!$A:$A=DATE(Calendário!$AA$11,Calendário!$AA$10,Calendário!J15),\"\"))","v":"19:00 | Puran"},null,null,{"$f":"IF(M15=\"\",\"\",_xlfn._xlws.FILTER(Base!$B:$B,Base!$A:$A=DATE(Calendário!$AA$11,Calendário!$AA$10,Calendário!M15),\"\"))","v":"19:00 | Puran"},null,null,{"$f":"IF(P15=\"\",\"\",_xlfn._xlws.FILTER(Base!$B:$B,Base!$A:$A=DATE(Calendário!$AA$11,Calendário!$AA$10,Calendário!P15),\"\"))","v":"19:00 | Puran"},null,null,{"$f":"IF(S15=\"\",\"\",_xlfn._xlws.FILTER(Base!$B:$B,Base!$A:$A=DATE(Calendário!$AA$11,Calendário!$AA$10,Calendário!S15),\"\"))","v":"19:00 | Puran"},null,null,{"$f":"IF(V15=\"\",\"\",_xlfn._xlws.FILTER(Base!$B:$B,Base!$A:$A=DATE(Calendário!$AA$11,Calendário!$AA$10,Calendário!V15),\"\"))","v":"19:00 | Puran"}]
[]
[]
[]
[]
[]
[null,null,null,{"$f":"V15+1","v":10},{"$f":"IFERROR(IF(D22=$AA$9,\"Início do tratamento!\",IF(D22=$AD$9,\"Início do tratamento!\",IF(D22=$AG$9,\"Início do tratamento!\",IF(D22=$AJ$9,\"Início do tratamento!\",IF(D22=$AM$9,\"Início do tratamento!\",\"\"))))),\"\")","v":""},null,{"$f":"D22+1","v":11},{"$f":"IFERROR(IF(G22=$AA$9,\"Início do tratamento!\",IF(G22=$AD$9,\"Início do tratamento!\",IF(G22=$AG$9,\"Início do tratamento!\",IF(G22=$AJ$9,\"Início do tratamento!\",IF(G22=$AM$9,\"Início do tratamento!\",\"\"))))),\"\")","v":""},null,{"$f":"G22+1","v":12},{"$f":"IFERROR(IF(J22=$AA$9,\"Início do tratamento!\",IF(J22=$AD$9,\"Início do tratamento!\",IF(J22=$AG$9,\"Início do tratamento!\",IF(J22=$AJ$9,\"Início do tratamento!\",IF(J22=$AM$9,\"Início do tratamento!\",\"\"))))),\"\")","v":""},null,{"$f":"J22+1","v":13},{"$f":"IFERROR(IF(M22=$AA$9,\"Início do tratamento!\",IF(M22=$AD$9,\"Início do tratamento!\",IF(M22=$AG$9,\"Início do tratamento!\",IF(M22=$AJ$9,\"Início do tratamento!\",IF(M22=$AM$9,\"Início do tratamento!\",\"\"))))),\"\")","v":""},null,{"$f":"M22+1","v":14},{"$f":"IFERROR(IF(P22=$AA$9,\"Início do tratamento!\",IF(P22=$AD$9,\"Início do tratamento!\",IF(P22=$AG$9,\"Início do tratamento!\",IF(P22=$AJ$9,\"Início do tratamento!\",IF(P22=$AM$9,\"Início do tratamento!\",\"\"))))),\"\")","v":""},null,{"$f":"P22+1","v":15},{"$f":"IFERROR(IF(S22=$AA$9,\"Início do tratamento!\",IF(S22=$AD$9,\"Início do tratamento!\",IF(S22=$AG$9,\"Início do tratamento!\",IF(S22=$AJ$9,\"Início do tratamento!\",IF(S22=$AM$9,\"Início do tratamento!\",\"\"))))),\"\")","v":""},null,{"$f":"S22+1","v":16},{"$f":"IFERROR(IF(V22=$AA$9,\"Início do tratamento!\",IF(V22=$AD$9,\"Início do tratamento!\",IF(V22=$AG$9,\"Início do tratamento!\",IF(V22=$AJ$9,\"Início do tratamento!\",IF(V22=$AM$9,\"Início do tratamento!\",\"\"))))),\"\")","v":""}]
[null,null,null,null,{"$f":"IF(D22=\"\",\"\",_xlfn._xlws.FILTER(Base!$B:$B,Base!$A:$A=DATE(Calendário!$AA$11,Calendário!$AA$10,Calendário!D22),\"\"))","v":"19:00 | Puran"},null,null,{"$f":"IF(G22=\"\",\"\",_xlfn._xlws.FILTER(Base!$B:$B,Base!$A:$A=DATE(Calendário!$AA$11,Calendário!$AA$10,Calendário!G22),\"\"))","v":"19:00 | Puran"},null,null,{"$f":"IF(J22=\"\",\"\",_xlfn._xlws.FILTER(Base!$B:$B,Base!$A:$A=DATE(Calendário!$AA$11,Calendário!$AA$10,Calendário!J22),\"\"))","v":"19:00 | Puran"},null,null,{"$f":"IF(M22=\"\",\"\",_xlfn._xlws.FILTER(Base!$B:$B,Base!$A:$A=DATE(Calendário!$AA$11,Calendário!$AA$10,Calendário!M22),\"\"))","v":"19:00 | Puran"},null,null,{"$f":"IF(P22=\"\",\"\",_xlfn._xlws.FILTER(Base!$B:$B,Base!$A:$A=DATE(Calendário!$AA$11,Calendário!$AA$10,Calendário!P22),\"\"))","v":"19:00 | Puran"},null,null,{"$f":"IF(S22=\"\",\"\",_xlfn._xlws.FILTER(Base!$B:$B,Base!$A:$A=DATE(Calendário!$AA$11,Calendário!$AA$10,Calendário!S22),\"\"))","v":"19:00 | Puran"},null,null,{"$f":"IF(V22=\"\",\"\",_xlfn._xlws.FILTER(Base!$B:$B,Base!$A:$A=DATE(Calendário!$AA$11,Calendário!$AA$10,Calendário!V22),\"\"))","v":"19:00 | Puran"}]
[]
[]
[]
[]
[]
[null,null,null,{"$f":"V22+1","v":17},{"$f":"IFERROR(IF(D29=$AA$9,\"Início do tratamento!\",IF(D29=$AD$9,\"Início do tratamento!\",IF(D29=$AG$9,\"Início do tratamento!\",IF(D29=$AJ$9,\"Início do tratamento!\",IF(D29=$AM$9,\"Início do tratamento!\",\"\"))))),\"\")","v":""},null,{"$f":"D29+1","v":18},{"$f":"IFERROR(IF(G29=$AA$9,\"Início do tratamento!\",IF(G29=$AD$9,\"Início do tratamento!\",IF(G29=$AG$9,\"Início do tratamento!\",IF(G29=$AJ$9,\"Início do tratamento!\",IF(G29=$AM$9,\"Início do tratamento!\",\"\"))))),\"\")","v":""},null,{"$f":"G29+1","v":19},{"$f":"IFERROR(IF(J29=$AA$9,\"Início do tratamento!\",IF(J29=$AD$9,\"Início do tratamento!\",IF(J29=$AG$9,\"Início do tratamento!\",IF(J29=$AJ$9,\"Início do tratamento!\",IF(J29=$AM$9,\"Início do tratamento!\",\"\"))))),\"\")","v":""},null,{"$f":"J29+1","v":20},{"$f":"IFERROR(IF(M29=$AA$9,\"Início do tratamento!\",IF(M29=$AD$9,\"Início do tratamento!\",IF(M29=$AG$9,\"Início do tratamento!\",IF(M29=$AJ$9,\"Início do tratamento!\",IF(M29=$AM$9,\"Início do tratamento!\",\"\"))))),\"\")","v":""},null,{"$f":"M29+1","v":21},{"$f":"IFERROR(IF(P29=$AA$9,\"Início do tratamento!\",IF(P29=$AD$9,\"Início do tratamento!\",IF(P29=$AG$9,\"Início do tratamento!\",IF(P29=$AJ$9,\"Início do tratamento!\",IF(P29=$AM$9,\"Início do tratamento!\",\"\"))))),\"\")","v":""},null,{"$f":"P29+1","v":22},{"$f":"IFERROR(IF(S29=$AA$9,\"Início do tratamento!\",IF(S29=$AD$9,\"Início do tratamento!\",IF(S29=$AG$9,\"Início do tratamento!\",IF(S29=$AJ$9,\"Início do tratamento!\",IF(S29=$AM$9,\"Início do tratamento!\",\"\"))))),\"\")","v":""},null,{"$f":"S29+1","v":23},{"$f":"IFERROR(IF(V29=$AA$9,\"Início do tratamento!\",IF(V29=$AD$9,\"Início do tratamento!\",IF(V29=$AG$9,\"Início do tratamento!\",IF(V29=$AJ$9,\"Início do tratamento!\",IF(V29=$AM$9,\"Início do tratamento!\",\"\"))))),\"\")","v":""}]
[null,null,null,null,{"$f":"IF(D29=\"\",\"\",_xlfn._xlws.FILTER(Base!$B:$B,Base!$A:$A=DATE(Calendário!$AA$11,Calendário!$AA$10,Calendário!D29),\"\"))","v":"19:00 | Puran"},null,null,{"$f":"IF(G29=\"\",\"\",_xlfn._xlws.FILTER(Base!$B:$B,Base!$A:$A=DATE(Calendário!$AA$11,Calendário!$AA$10,Calendário!G29),\"\"))","v":"19:00 | Puran"},null,null,{"$f":"IF(J29=\"\",\"\",_xlfn._xlws.FILTER(Base!$B:$B,Base!$A:$A=DATE(Calendário!$AA$11,Calendário!$AA$10,Calendário!J29),\"\"))","v":"19:00 | Puran"},null,null,{"$f":"IF(M29=\"\",\"\",_xlfn._xlws.FILTER(Base!$B:$B,Base!$A:$A=DATE(Calendário!$AA$11,Calendário!$AA$10,Calendário!M29),\"\"))","v":"19:00 | Puran"},null,null,{"$f":"IF(P29=\"\",\"\",_xlfn._xlws.FILTER(Base!$B:$B,Base!$A:$A=DATE(Calendário!$AA$11,Calendário!$AA$10,Calendário!P29),\"\"))","v":"19:00 | Puran"},null,null,{"$f":"IF(S29=\"\",\"\",_xlfn._xlws.FILTER(Base!$B:$B,Base!$A:$A=DATE(Calendário!$AA$11,Calendário!$AA$10,Calendário!S29),\"\"))","v":"19:00 | Puran"},null,null,{"$f":"IF(V29=\"\",\"\",_xlfn._xlws.FILTER(Base!$B:$B,Base!$A:$A=DATE(Calendário!$AA$11,Calendário!$AA$10,Calendário!V29),\"\"))","v":"19:00 | Puran"}]
[]
[]
[]
[]
[]
[null,null,null,{"$f":"IF(V29=\"\",\"\",IF(V29+1>$AA$15,\"\",V29+1))","v":24},{"$f":"IFERROR(IF(D36=$AA$9,\"Início do tratamento!\",IF(D36=$AD$9,\"Início do tratamento!\",IF(D36=$AG$9,\"Início do tratamento!\",IF(D36=$AJ$9,\"Início do tratamento!\",IF(D36=$AM$9,\"Início do tratamento!\",\"\"))))),\"\")","v":""},null,{"$f":"IF(D36=\"\",\"\",IF(D36+1>$AA$15,\"\",D36+1))","v":25},{"$f":"IFERROR(IF(G36=$AA$9,\"Início do tratamento!\",IF(G36=$AD$9,\"Início do tratamento!\",IF(G36=$AG$9,\"Início do tratamento!\",IF(G36=$AJ$9,\"Início do tratamento!\",IF(G36=$AM$9,\"Início do tratamento!\",\"\"))))),\"\")","v":""},null,{"$f":"IF(G36=\"\",\"\",IF(G36+1>$AA$15,\"\",G36+1))","v":26},{"$f":"IFERROR(IF(J36=$AA$9,\"Início do tratamento!\",IF(J36=$AD$9,\"Início do tratamento!\",IF(J36=$AG$9,\"Início do tratamento!\",IF(J36=$AJ$9,\"Início do tratamento!\",IF(J36=$AM$9,\"Início do tratamento!\",\"\"))))),\"\")","v":""},null,{"$f":"IF(J36=\"\",\"\",IF(J36+1>$AA$15,\"\",J36+1))","v":27},{"$f":"IFERROR(IF(M36=$AA$9,\"Início do tratamento!\",IF(M36=$AD$9,\"Início do tratamento!\",IF(M36=$AG$9,\"Início do tratamento!\",IF(M36=$AJ$9,\"Início do tratamento!\",IF(M36=$AM$9,\"Início do tratamento!\",\"\"))))),\"\")","v":""},null,{"$f":"IF(M36=\"\",\"\",IF(M36+1>$AA$15,\"\",M36+1))","v":28},{"$f":"IFERROR(IF(P36=$AA$9,\"Início do tratamento!\",IF(P36=$AD$9,\"Início do tratamento!\",IF(P36=$AG$9,\"Início do tratamento!\",IF(P36=$AJ$9,\"Início do tratamento!\",IF(P36=$AM$9,\"Início do tratamento!\",\"\"))))),\"\")","v":""},null,{"$f":"IF(P36=\"\",\"\",IF(P36+1>$AA$15,\"\",P36+1))","v":29},{"$f":"IFERROR(IF(S36=$AA$9,\"Início do tratamento!\",IF(S36=$AD$9,\"Início do tratamento!\",IF(S36=$AG$9,\"Início do tratamento!\",IF(S36=$AJ$9,\"Início do tratamento!\",IF(S36=$AM$9,\"Início do tratamento!\",\"\"))))),\"\")","v":""},null,{"$f":"IF(S36=\"\",\"\",IF(S36+1>$AA$15,\"\",S36+1))","v":30},{"$f":"IFERROR(IF(V36=$AA$9,\"Início do tratamento!\",IF(V36=$AD$9,\"Início do tratamento!\",IF(V36=$AG$9,\"Início do tratamento!\",IF(V36=$AJ$9,\"Início do tratamento!\",IF(V36=$AM$9,\"Início do tratamento!\",\"\"))))),\"\")","v":""}]
[null,null,null,null,{"$f":"IF(D36=\"\",\"\",_xlfn._xlws.FILTER(Base!$B:$B,Base!$A:$A=DATE(Calendário!$AA$11,Calendário!$AA$10,Calendário!D36),\"\"))","v":"19:00 | Puran"},null,null,{"$f":"IF(G36=\"\",\"\",_xlfn._xlws.FILTER(Base!$B:$B,Base!$A:$A=DATE(Calendário!$AA$11,Calendário!$AA$10,Calendário!G36),\"\"))","v":"19:00 | Puran"},null,null,{"$f":"IF(J36=\"\",\"\",_xlfn._xlws.FILTER(Base!$B:$B,Base!$A:$A=DATE(Calendário!$AA$11,Calendário!$AA$10,Calendário!J36),\"\"))","v":"19:00 | Puran"},null,null,{"$f":"IF(M36=\"\",\"\",_xlfn._xlws.FILTER(Base!$B:$B,Base!$A:$A=DATE(Calendário!$AA$11,Calendário!$AA$10,Calendário!M36),\"\"))","v":"19:00 | Puran"},null,null,{"$f":"IF(P36=\"\",\"\",_xlfn._xlws.FILTER(Base!$B:$B,Base!$A:$A=DATE(Calendário!$AA$11,Calendário!$AA$10,Calendário!P36),\"\"))","v":"19:00 | Puran"},null,null,{"$f":"IF(S36=\"\",\"\",_xlfn._xlws.FILTER(Base!$B:$B,Base!$A:$A=DATE(Calendário!$AA$11,Calendário!$AA$10,Calendário!S36),\"\"))","v":""},null,null,{"$f":"IF(V36=\"\",\"\",_xlfn._xlws.FILTER(Base!$B:$B,Base!$A:$A=DATE(Calendário!$AA$11,Calendário!$AA$10,Calendário!V36),\"\"))","v":""}]
[]
[]
[]
{"$rows_left_out":728}
{"sheet":"Base","index":2,"n_rows":294,"n_cols":21,"rows_kept":294,"cut":false,"hidden":true,"merged":[]}
[null,null,null,null,null,null,null,null,null,null,null,null,{"$f":"COUNT((M5:M10))","v":0}]
[null,null,null,null,null,null,null,null,null,null,{"$f":"AND(EXACT(L2:O2,L2))","v":true},{"$f":"COUNTA(L5:L10)","v":0},{"$f":"COUNTA(M5:M10)","v":0},{"$f":"COUNTA(N5:N10)","v":0},{"$f":"COUNTA(O5:O10)","v":0}]
["LEMBRETES",null,null,{"$f":"IFERROR(_xlfn.XLOOKUP(C3,Início!$C$20:$C$25,Início!$I$20:$I$25,\"\"),\"\")","v":""},{"$f":"_xlfn.XLOOKUP(C3,$R$5:$R$10,$K$5:$K$10,C3,0)","v":0},null,null,null,null,null,null,null,null,null,null,{"$f":"M1+Início!F12","v":3},null,null,null,"MESES"]
["Dia","Lembrete","ID","Status","Novo ID",null,null,"IDF","FREQUÊNCIA",null,"ID","Medicamento","Data","Hora","Qtde dias","H+M","Status","Old ID",null,"NMÊS","MÊS"]
["2023-07-01","06:00 | Caixinha",0,null,null,null,null,1,"1x ao dia",1,1,null,null,null,null,{"$f":"TEXT(N5,\"hh:mm\")&\" | \"&L5","v":"00:00 | "},{"$f":"_xlfn.XLOOKUP(K5,Início!$C$20:$C$25,Início!$I$20:$I$25,\"\")","v":0},1,null,1,"JANEIRO"]
["2023-07-02","06:00 | Caixinha",0,null,null,null,null,2,"12h/12h",2,2,null,null,null,null,{"$f":"TEXT(N6,\"hh:mm\")&\" | \"&L6","v":"00:00 | "},{"$f":"_xlfn.XLOOKUP(K6,Início!$C$20:$C$25,Início!$I$20:$I$25,\"\")","v":0},2,null,2,"FEVEREIRO"]
["2023-07-03","06:00 | Caixinha",0,null,null,null,null,3,null,3,3,null,null,null,null,"00:00 | ",{"$f":"_xlfn.XLOOKUP(K7,Início!$C$20:$C$25,Início!$I$20:$I$25,\"\")","v":0},3,null,3,"MARÇO"]
["2023-07-04","06:00 | Caixinha",0,null,null,null,null,null,null,4,4,null,null,null,null,"00:00 | ",{"$f":"_xlfn.XLOOKUP(K8,Início!$C$20:$C$25,Início!$I$20:$I$25,\"\")","v":0},4,null,4,"ABRIL"]
["2023-07-05","06:00 | Caixinha",0,null,null,null,null,null,null,5,5,null,null,null,null,"00:00 | ",{"$f":"_xlfn.XLOOKUP(K9,Início!$C$20:$C$25,Início!$I$20:$I$25,\"\")","v":0},5,null,5,"MAIO"]
["2023-07-06","06:00 | Caixinha",0,null,null,null,null,null,null,6,6,null,null,null,null,"00:00 | ",{"$f":"_xlfn.XLOOKUP(K10,Início!$C$20:$C$25,Início!$I$20:$I$25,\"\")","v":0},6,null,6,"JUNHO"]
["2023-07-07","06:00 | Caixinha",0,null,null,null,null,null,null,null,null,null,null,null,null,null,null,null,null,7,"JULHO"]
["2023-07-08","06:00 | Caixinha",0,null,null,null,null,null,null,null,null,null,null,null,null,null,null,null,null,8,"AGOSTO"]
["2023-07-09","06:00 | Caixinha",0,null,null,null,null,null,null,null,null,null,null,null,null,null,null,null,null,9,"SETEMBRO"]
["2023-07-10","06:00 | Caixinha",0,null,null,null,null,null,null,null,null,null,null,null,null,null,null,null,null,10,"OUTUBRO"]
["2023-07-11","06:00 | Caixinha",0,null,null,null,null,null,null,null,null,null,null,null,null,null,null,null,null,11,"NOVEMBRO"]
["2023-07-12","06:00 | Caixinha",0,null,null,null,null,null,null,null,null,null,null,null,null,null,null,null,null,12,"DEZEMBRO"]
["2023-07-13","06:00 | Caixinha",0]
["2023-07-14","06:00 | Caixinha",0]
["2023-07-15","06:00 | Caixinha",0]
["2023-07-16","06:00 | Caixinha",0]
["2023-07-17","06:00 | Caixinha",0]
["2023-07-18","06:00 | Caixinha",0]
["2023-07-19","06:00 | Caixinha",0]
["2023-07-20","06:00 | Caixinha",0]
["2023-07-21","06:00 | Caixinha",0]
["2023-07-22","06:00 | Caixinha",0]
["2023-07-23","06:00 | Caixinha",0]
["2023-07-24","06:00 | Caixinha",0]
["2023-07-25","06:00 | Caixinha",0]
["2023-07-26","06:00 | Caixinha",0]
["2023-07-27","06:00 | Caixinha",0]
["2023-07-28","06:00 | Caixinha",0]
["2023-07-29","06:00 | Caixinha",0]
["2023-07-30","06:00 | Caixinha",0]
["2023-07-31","06:00 | Caixinha",0]
["2023-08-01","06:00 | Caixinha",0]
["2023-08-02","06:00 | Caixinha",0]
["2023-08-03","06:00 | Caixinha",0]
["2023-08-04","06:00 | Caixinha",0]
["2023-08-05","06:00 | Caixinha",0]
{"$rows_left_out":254}